Tests that fail together
3 tests in 1 exact outcome cohort. Each group has the same normalized outcomes, retry states, skips and missing runs. A shared history is a lead to investigate, not proof of a common cause.
Download all shared-outcome evidenceShowing 1 of 1 cohorts, ordered by affected test-runs. Final failures and passed-on-retry results remain separate.
3 tests share 3 final-failure runs and 0 recovered runs
Matching run history
- Pass without retry (9)
run-01,run-02,run-03,run-06,run-07,run-08,run-09,run-11,run-12- Final fail or error (3)
run-04,run-05,run-10
Members (3)
tests.test_service.test_inventory_endpointtests.test_service.test_pricing_endpointtests.test_service.test_shipping_endpoint
Showing 9 of 9 affected test-runs. Source positions are 1-based result ordinals. Long text and retry lists are previewed; the JSON download retains every record.
Scroll the evidence table horizontally to inspect every column.
| Run / environment | Test | Reported outcome | Source and message |
|---|---|---|---|
run-04controlled-loopback-capture / Linux | test_inventory_endpoint | fail | run-04/report.xml :: testcase 1AssertionError: Inventory endpoint returned HTTP 503 |
run-04controlled-loopback-capture / Linux | test_pricing_endpoint | fail | run-04/report.xml :: testcase 3AssertionError: Pricing endpoint returned HTTP 503 |
run-04controlled-loopback-capture / Linux | test_shipping_endpoint | fail | run-04/report.xml :: testcase 2AssertionError: Shipping endpoint returned HTTP 503 |
run-05controlled-loopback-capture / Linux | test_inventory_endpoint | fail | run-05/report.xml :: testcase 1AssertionError: Inventory endpoint returned HTTP 503 |
run-05controlled-loopback-capture / Linux | test_pricing_endpoint | fail | run-05/report.xml :: testcase 3AssertionError: Pricing endpoint returned HTTP 503 |
run-05controlled-loopback-capture / Linux | test_shipping_endpoint | fail | run-05/report.xml :: testcase 2AssertionError: Shipping endpoint returned HTTP 503 |
run-10controlled-loopback-capture / Linux | test_inventory_endpoint | fail | run-10/report.xml :: testcase 1AssertionError: Inventory endpoint returned HTTP 503 |
run-10controlled-loopback-capture / Linux | test_pricing_endpoint | fail | run-10/report.xml :: testcase 3AssertionError: Pricing endpoint returned HTTP 503 |
run-10controlled-loopback-capture / Linux | test_shipping_endpoint | fail | run-10/report.xml :: testcase 2AssertionError: Shipping endpoint returned HTTP 503 |
Test × run heatmap
Tests under tests.test_service
test_inventory_endpoint INTERMITTENT 25%
tests.test_service.test_inventory_endpoint
Failures, newest first
| Run | Same commit, other runs | Other tests failed | Named in output, or message |
|---|---|---|---|
run-102026-10-07 20:23 | commit not recorded | 2 | AssertionError: Inventory endpoint returned HTTP 503 |
run-052026-10-07 20:23 | commit not recorded | 3 | AssertionError: Inventory endpoint returned HTTP 503 |
run-042026-10-07 20:23 | commit not recorded | 2 | AssertionError: Inventory endpoint returned HTTP 503 |
test_shipping_endpoint INTERMITTENT 25%
tests.test_service.test_shipping_endpoint
Failures, newest first
| Run | Same commit, other runs | Other tests failed | Named in output, or message |
|---|---|---|---|
run-102026-10-07 20:23 | commit not recorded | 2 | AssertionError: Shipping endpoint returned HTTP 503 |
run-052026-10-07 20:23 | commit not recorded | 3 | AssertionError: Shipping endpoint returned HTTP 503 |
run-042026-10-07 20:23 | commit not recorded | 2 | AssertionError: Shipping endpoint returned HTTP 503 |
test_pricing_endpoint INTERMITTENT 25%
tests.test_service.test_pricing_endpoint
Failures, newest first
| Run | Same commit, other runs | Other tests failed | Named in output, or message |
|---|---|---|---|
run-102026-10-07 20:23 | commit not recorded | 2 | AssertionError: Pricing endpoint returned HTTP 503 |
run-052026-10-07 20:23 | commit not recorded | 3 | AssertionError: Pricing endpoint returned HTTP 503 |
run-042026-10-07 20:23 | commit not recorded | 2 | AssertionError: Pricing endpoint returned HTTP 503 |
test_optional_endpoint INTERMITTENT 10%
tests.test_service.test_optional_endpoint
Failures, newest first
| Run | Same commit, other runs | Other tests failed | Named in output, or message |
|---|---|---|---|
run-052026-10-07 20:23 | commit not recorded | 3 | AssertionError: Optional endpoint returned HTTP 503 |
test_independent_math INTERMITTENT 8.3%
tests.test_service.test_independent_math
Failures, newest first
| Run | Same commit, other runs | Other tests failed | Named in output, or message |
|---|---|---|---|
run-072026-10-07 20:23 | commit not recorded | none | assert 4 == 5 |