flakemap — inspection report

Test reliability across CI history, computed from JUnit XML and TRX.

runs 2,153 tests 1,524 run range 2075038707336876032 → 2108052289355780096 window 2026-07-09 → 2026-10-08
0broken
28flaky
3new flakes
5flaky, now quiet
1,496healthy
0insufficient data
0test-runs passed on retry
0test-runs excluded

Test × run history

[sig-node] k8s.io/kubernetes/cmd/kubelet.app NEW FLAKE 2096165448054738944 · 2026-09-05 09:16 · fail · b2ec8b6fefac · panic: test timed out after 3m0s2098218497547964416 · 2026-09-11 01:14 · fail · 1b2ebe523cdc · panic: test timed out after 3m0s2099101033341915136 · 2026-09-13 11:42 · fail · d5cbb79be916 · panic: test timed out after 3m0s2099676581235527680 · 2026-09-15 01:48 · fail · e5f62fbfa6d9 · panic: test timed out after 3m0s2101957288901218304 · 2026-09-21 08:53 · fail · a34ca95edfae · panic: test timed out after 3m0s2102412549650649088 · 2026-09-22 15:00 · fail · 4e7dab5dc4b5 · panic: test timed out after 3m0s2107305611875061760 · 2026-10-06 03:03 · fail · e234a6f2036b · panic: test timed out after 3m0s 7 0.33%

[sig-node] k8s.io/kubernetes/cmd/kubelet.app

Final failure rate (95% CI)0.33% [0.16%–0.67%] · 7 of 2,153 runs
Usable outcomesruns: 2,153; skipped: 0; excluded: 0
Passed on retry0 (explicit failed attempts before a pass)
Retry exhaustion0 (every recorded attempt failed)
Flip rate0.65% of 2,152 usable consecutive pairs
Same-context rerun disagreement5/305 commit/branch/runner/OS groups; 0.52% of same-commit run pairs
Flakiness score0.006
Failures on a commit run again5 of 5 passed in another run of the same commit; 0 failed in every run of it; 2 more had no other run
ActivityNew: 7 failures; the longest quiet spell between failures was 321 runs, and the first failure came after 1,373 clean runs of 2,153.
Duration trend (without retries)+6.6 ms/history run
Timing observations (without retries)2153
Duration × failure correlation+0.50
Failure messages
  • panic: test timed out after 3m0s ×7

Failures, newest first

RunSame commit, other runsOther tests failedNamed in output, or message
2107305611875061760
2026-10-06 03:03
e234a6f2036b
passed in another run (3 of this commit)
nonepanic: test timed out after 3m0s
2102412549650649088
2026-09-22 15:00
4e7dab5dc4b5
no other run
nonepanic: test timed out after 3m0s
2101957288901218304
2026-09-21 08:53
a34ca95edfae
no other run
nonepanic: test timed out after 3m0s
2099676581235527680
2026-09-15 01:48
e5f62fbfa6d9
passed in another run (11 of this commit)
nonepanic: test timed out after 3m0s
2099101033341915136
2026-09-13 11:42
d5cbb79be916
passed in another run (31 of this commit)
nonepanic: test timed out after 3m0s
2098218497547964416
2026-09-11 01:14
1b2ebe523cdc
passed in another run (5 of this commit)
nonepanic: test timed out after 3m0s
2096165448054738944
2026-09-05 09:16
b2ec8b6fefac
passed in another run (55 of this commit)
nonepanic: test timed out after 3m0s
[sig-testing] k8s.io/kubernetes/test/utils.ktesting NEW FLAKE 2098751225045454848 · 2026-09-12 12:31 · fail · def9a441f53a · TestCause/cancelCause, TestCause2103036203191242752 · 2026-09-24 08:18 · fail · 457ebaa229bd · TestCause/cancelCause, TestCause2106153256286687232 · 2026-10-02 22:44 · fail · 64f2319ebd23 · TestCause/cancelText, TestCause2107093786382307328 · 2026-10-05 13:01 · fail · ff9ed88330a0 · TestCause/cancelText, TestCause 4 0.19%

[sig-testing] k8s.io/kubernetes/test/utils.ktesting

Final failure rate (95% CI)0.19% [0.073%–0.48%] · 4 of 2,138 runs
Usable outcomesruns: 2,138; skipped: 0; excluded: 0
Passed on retry0 (explicit failed attempts before a pass)
Retry exhaustion0 (every recorded attempt failed)
Flip rate0.37% of 2,137 usable consecutive pairs
Same-context rerun disagreement3/301 commit/branch/runner/OS groups; 0.32% of same-commit run pairs
Flakiness score0.004
Failures on a commit run again3 of 3 passed in another run of the same commit; 0 failed in every run of it; 1 more had no other run
ActivityNew: 4 failures; the longest quiet spell between failures was 280 runs, and the first failure came after 1,541 clean runs of 2,138.
Duration trend (without retries)+0.1 ms/history run
Timing observations (without retries)2138
Duration × failure correlation-0.45
Failure messages
  • contexthelper_test.go:239: ERROR: I0101 00:00:00.000000] ×4

Tests named in this testcase's failures

The report keeps one record for the whole package; these names come from the failure output (--- FAIL: lines).

TestFailed runsPassed on same commitActivity
TestCause43 of 3first failed 597 runs ago, last 48 runs ago

Failures, newest first

RunSame commit, other runsOther tests failedNamed in output, or message
2107093786382307328
2026-10-05 13:01
ff9ed88330a0
passed in another run (2 of this commit)
noneTestCause/cancelText, TestCause
2106153256286687232
2026-10-02 22:44
64f2319ebd23
passed in another run (3 of this commit)
noneTestCause/cancelText, TestCause
2103036203191242752
2026-09-24 08:18
457ebaa229bd
no other run
noneTestCause/cancelCause, TestCause
2098751225045454848
2026-09-12 12:31
def9a441f53a
passed in another run (10 of this commit)
noneTestCause/cancelCause, TestCause
[sig-apps] k8s.io/kubernetes/pkg/controller.replicaset NEW FLAKE 2094507759742488576 · 2026-08-31 19:29 · fail · 3e492af913b0 · TestExpectationsOnRecreate2098370752171479040 · 2026-09-11 11:19 · fail · bbd0a69d228a · TestExpectationsOnRecreate2104648304036941824 · 2026-09-28 19:04 · fail · 8d3071315a65 · TestExpectationsOnRecreate 3 0.14%

[sig-apps] k8s.io/kubernetes/pkg/controller.replicaset

Final failure rate (95% CI)0.14% [0.047%–0.41%] · 3 of 2,153 runs
Usable outcomesruns: 2,153; skipped: 0; excluded: 0
Passed on retry0 (explicit failed attempts before a pass)
Retry exhaustion0 (every recorded attempt failed)
Flip rate0.28% of 2,152 usable consecutive pairs
Same-context rerun disagreement1/305 commit/branch/runner/OS groups; 0.10% of same-commit run pairs
Flakiness score0.002
Failures on a commit run again1 of 1 passed in another run of the same commit; 0 failed in every run of it; 2 more had no other run
ActivityNew: 3 failures; the longest quiet spell between failures was 411 runs, and the first failure came after 1,264 clean runs of 2,153.
Duration trend (without retries)+0.1 ms/history run
Timing observations (without retries)2153
Duration × failure correlation-0.28
Failure messages
  • testing.go:1865: race detected during execution of test ×3

Tests named in this testcase's failures

The report keeps one record for the whole package; these names come from the failure output (--- FAIL: lines).

TestFailed runsPassed on same commitActivity
TestExpectationsOnRecreate31 of 1first failed 889 runs ago, last 224 runs ago

Failures, newest first

RunSame commit, other runsOther tests failedNamed in output, or message
2104648304036941824
2026-09-28 19:04
8d3071315a65
no other run
noneTestExpectationsOnRecreate
2098370752171479040
2026-09-11 11:19
bbd0a69d228a
no other run
noneTestExpectationsOnRecreate
2094507759742488576
2026-08-31 19:29
3e492af913b0
passed in another run (2 of this commit)
noneTestExpectationsOnRecreate
[sig-node] k8s.io/kubernetes/pkg/kubelet.volumemanager INTERMITTENT 2077721828238823424 · 2026-07-16 11:48 · fail · a0b3d14d2753 · TestWaitForAllPodsUnmount/concurrent_unmount_-_many_pods_(20)_with_timeout_errors, TestWaitForAllPodsUnmount2078259126579761152 · 2026-07-17 23:23 · fail · 1a4ff29bca9d · TestWaitForAllPodsUnmount/concurrent_unmount_-_many_pods_(20)_with_timeout_errors, TestWaitForAllPodsUnmount2079547877390028800 · 2026-07-21 12:44 · fail · 0ad890bc6e07 · TestWaitForAllPodsUnmount/concurrent_unmount_-_many_pods_(20)_with_timeout_errors, TestWaitForAllPodsUnmount2081370975961616384 · 2026-07-26 13:28 · fail · 752b88759ecf · TestWaitForAllPodsUnmount/concurrent_unmount_-_many_pods_(20)_with_timeout_errors, TestWaitForAllPodsUnmount2082011961184227328 · 2026-07-28 07:55 · fail · 7bd662ff25ec · TestWaitForAllPodsUnmount/concurrent_unmount_-_many_pods_(20)_with_timeout_errors, TestWaitForAllPodsUnmount2084273615288668160 · 2026-08-03 13:42 · fail · 0e5f0f9374ca · TestWaitForAllPodsUnmount/concurrent_unmount_-_many_pods_(20)_with_timeout_errors, TestWaitForAllPodsUnmount2085574043850772480 · 2026-08-07 03:50 · fail · b882c60b4023 · TestWaitForAllPodsUnmount/concurrent_unmount_-_many_pods_(20)_with_timeout_errors, TestWaitForAllPodsUnmount2086124177563062272 · 2026-08-08 16:16 · fail · b882c60b4023 · TestWaitForAllPodsUnmount/concurrent_unmount_-_many_pods_(20)_with_timeout_errors, TestWaitForAllPodsUnmount2086185581817106432 · 2026-08-08 20:20 · fail · b882c60b4023 · TestWaitForAllPodsUnmount/concurrent_unmount_-_many_pods_(20)_with_timeout_errors, TestWaitForAllPodsUnmount2086798122125627392 · 2026-08-10 12:56 · fail · 94c136764292 · TestWaitForAllPodsUnmount/concurrent_unmount_-_many_pods_(20)_with_timeout_errors, TestWaitForAllPodsUnmount2090330625599868928 · 2026-08-20 06:51 · fail · 65bca7cd12f0 · TestWaitForAllPodsUnmount/concurrent_unmount_-_many_pods_(20)_with_timeout_errors, TestWaitForAllPodsUnmount2 consecutive runs, fail · first: 2095282875392856064 · 2026-09-02 22:49 · fail · eac35879c591 · TestWaitForAllPodsUnmount/concurrent_unmount_-_many_pods_(20)_with_timeout_errors, TestWaitForAllPodsUnmount · last: 20952979749879193602095663386162368512 · 2026-09-04 00:01 · fail · 31f2745a9ee2 · TestWaitForAllPodsUnmount/concurrent_unmount_-_many_pods_(20)_with_timeout_errors, TestWaitForAllPodsUnmount2102748015944011776 · 2026-09-23 13:13 · fail · 6d13e54a08b5 · TestWaitForAllPodsUnmount/concurrent_unmount_-_many_pods_(20)_with_timeout_errors, TestWaitForAllPodsUnmount2103873441567346688 · 2026-09-26 15:45 · fail · dfd7b93a1783 · TestWaitForAllPodsUnmount/concurrent_unmount_-_many_pods_(20)_with_timeout_errors, TestWaitForAllPodsUnmount2105743301092052992 · 2026-10-01 19:35 · fail · 36fb98934281 · TestWaitForAllPodsUnmount/concurrent_unmount_-_many_pods_(20)_with_timeout_errors, TestWaitForAllPodsUnmount 17 0.79%

[sig-node] k8s.io/kubernetes/pkg/kubelet.volumemanager

Final failure rate (95% CI)0.79% [0.49%–1.3%] · 17 of 2,153 runs
Usable outcomesruns: 2,153; skipped: 0; excluded: 0
Passed on retry0 (explicit failed attempts before a pass)
Retry exhaustion0 (every recorded attempt failed)
Flip rate1.5% of 2,152 usable consecutive pairs
Same-context rerun disagreement13/305 commit/branch/runner/OS groups; 1.6% of same-commit run pairs
Flakiness score0.015
Failures on a commit run again16 of 16 passed in another run of the same commit; 0 failed in every run of it; 1 more had no other run
ActivityOngoing: 17 failures in 16 separate stretches; the longest quiet spell between failures was 462 runs, and the last failure was 152 runs ago.
Duration trend (without retries)+1.0 ms/history run
Timing observations (without retries)2153
Duration × failure correlation+0.58
Failure messages
  • volume_manager_test.go:763: Received unexpected error: unmounted volumes=[vol-3], unattached volumes=[vol-3], failed to process volumes=[]: context deadline exceeded ×17

Tests named in this testcase's failures

The report keeps one record for the whole package; these names come from the failure output (--- FAIL: lines).

TestFailed runsPassed on same commitActivity
TestWaitForAllPodsUnmount1716 of 16first failed 1,978 runs ago, last 152 runs ago

Failures, newest first

RunSame commit, other runsOther tests failedNamed in output, or message
2105743301092052992
2026-10-01 19:35
36fb98934281
passed in another run (5 of this commit)
noneTestWaitForAllPodsUnmount/concurrent_unmount_-_many_pods_(20)_with_timeout_errors, TestWaitForAllPodsUnmount
2103873441567346688
2026-09-26 15:45
dfd7b93a1783
passed in another run (25 of this commit)
noneTestWaitForAllPodsUnmount/concurrent_unmount_-_many_pods_(20)_with_timeout_errors, TestWaitForAllPodsUnmount
2102748015944011776
2026-09-23 13:13
6d13e54a08b5
passed in another run (2 of this commit)
noneTestWaitForAllPodsUnmount/concurrent_unmount_-_many_pods_(20)_with_timeout_errors, TestWaitForAllPodsUnmount
2095663386162368512
2026-09-04 00:01
31f2745a9ee2
passed in another run (3 of this commit)
noneTestWaitForAllPodsUnmount/concurrent_unmount_-_many_pods_(20)_with_timeout_errors, TestWaitForAllPodsUnmount
2095297974987919360
2026-09-02 23:49
eac35879c591
passed in another run (3 of this commit)
noneTestWaitForAllPodsUnmount/concurrent_unmount_-_many_pods_(20)_with_timeout_errors, TestWaitForAllPodsUnmount
2095282875392856064
2026-09-02 22:49
eac35879c591
passed in another run (3 of this commit)
noneTestWaitForAllPodsUnmount/concurrent_unmount_-_many_pods_(20)_with_timeout_errors, TestWaitForAllPodsUnmount
2090330625599868928
2026-08-20 06:51
65bca7cd12f0
passed in another run (9 of this commit)
noneTestWaitForAllPodsUnmount/concurrent_unmount_-_many_pods_(20)_with_timeout_errors, TestWaitForAllPodsUnmount
2086798122125627392
2026-08-10 12:56
94c136764292
passed in another run (42 of this commit)
noneTestWaitForAllPodsUnmount/concurrent_unmount_-_many_pods_(20)_with_timeout_errors, TestWaitForAllPodsUnmount
2086185581817106432
2026-08-08 20:20
b882c60b4023
passed in another run (56 of this commit)
noneTestWaitForAllPodsUnmount/concurrent_unmount_-_many_pods_(20)_with_timeout_errors, TestWaitForAllPodsUnmount
2086124177563062272
2026-08-08 16:16
b882c60b4023
passed in another run (56 of this commit)
noneTestWaitForAllPodsUnmount/concurrent_unmount_-_many_pods_(20)_with_timeout_errors, TestWaitForAllPodsUnmount
2085574043850772480
2026-08-07 03:50
b882c60b4023
passed in another run (56 of this commit)
noneTestWaitForAllPodsUnmount/concurrent_unmount_-_many_pods_(20)_with_timeout_errors, TestWaitForAllPodsUnmount
2084273615288668160
2026-08-03 13:42
0e5f0f9374ca
passed in another run (4 of this commit)
noneTestWaitForAllPodsUnmount/concurrent_unmount_-_many_pods_(20)_with_timeout_errors, TestWaitForAllPodsUnmount
2082011961184227328
2026-07-28 07:55
7bd662ff25ec
passed in another run (7 of this commit)
noneTestWaitForAllPodsUnmount/concurrent_unmount_-_many_pods_(20)_with_timeout_errors, TestWaitForAllPodsUnmount
2081370975961616384
2026-07-26 13:28
752b88759ecf
passed in another run (28 of this commit)
noneTestWaitForAllPodsUnmount/concurrent_unmount_-_many_pods_(20)_with_timeout_errors, TestWaitForAllPodsUnmount
2079547877390028800
2026-07-21 12:44
0ad890bc6e07
no other run
noneTestWaitForAllPodsUnmount/concurrent_unmount_-_many_pods_(20)_with_timeout_errors, TestWaitForAllPodsUnmount
2078259126579761152
2026-07-17 23:23
1a4ff29bca9d
passed in another run (3 of this commit)
1TestWaitForAllPodsUnmount/concurrent_unmount_-_many_pods_(20)_with_timeout_errors, TestWaitForAllPodsUnmount
2077721828238823424
2026-07-16 11:48
a0b3d14d2753
passed in another run (3 of this commit)
1TestWaitForAllPodsUnmount/concurrent_unmount_-_many_pods_(20)_with_timeout_errors, TestWaitForAllPodsUnmount
[sig-storage] k8s.io/kubernetes/pkg/scheduler/framework/plugins.volumebinding INTERMITTENT 2075821000427048960 · 2026-07-11 05:54 · fail · 843726939e91 · TestCheckBindings/binding-claimref-uid-empty, TestCheckBindings2077184771565293568 · 2026-07-15 00:14 · fail · 153eedf9b826 · TestBindPodVolumes/binding-static-pv-succeeds-after-time, TestBindPodVolumes2077399450455642112 · 2026-07-15 14:27 · fail · ba3578f278d8 · TestCheckBindings/tolerate-provisioning-pvc-bound-pv-not-found, TestCheckBindings2079963032879894528 · 2026-07-22 16:14 · fail · 9c722bc288a7 · TestCheckBindings/tolerate-provisioning-pvc-bound-pv-not-found, TestCheckBindings2080345967529299968 · 2026-07-23 17:35 · fail · aa94f417962c · TestCheckBindings/tolerate-provisioning-pvc-bound-pv-not-found, TestCheckBindings2082058017792069633 · 2026-07-28 10:58 · fail · 5f91251764f1 · TestCheckBindings/binding-claimref-uid-empty, TestCheckBindings2085267269096574976 · 2026-08-06 07:31 · fail · 4f5591ab57b7 · TestCheckBindings/tolerate-provisioning-pvc-bound-pv-not-found, TestCheckBindings2088220450545995776 · 2026-08-14 11:09 · fail · a231bf3f3776 · TestCheckBindings/tolerate-provisioning-pvc-bound-pv-not-found, TestCheckBindings2089566081931808768 · 2026-08-18 04:13 · fail · c44d2a82ef7f · TestBindPodVolumes/binding-static-pv-succeeds-after-time, TestBindPodVolumes2104132652159209472 · 2026-09-27 08:55 · fail · 6c1c7702cf20 · TestCheckBindings/tolerate-provisioning-pvc-bound-pv-not-found, TestCheckBindings2105773499783057408 · 2026-10-01 21:35 · fail · 36fb98934281 · TestCheckBindings/tolerate-provisioning-pvc-bound-pv-not-found, TestCheckBindings 11 0.51%

[sig-storage] k8s.io/kubernetes/pkg/scheduler/framework/plugins.volumebinding

Final failure rate (95% CI)0.51% [0.29%–0.91%] · 11 of 2,153 runs
Usable outcomesruns: 2,153; skipped: 0; excluded: 0
Passed on retry0 (explicit failed attempts before a pass)
Retry exhaustion0 (every recorded attempt failed)
Flip rate1.0% of 2,152 usable consecutive pairs
Same-context rerun disagreement11/305 commit/branch/runner/OS groups; 1.2% of same-commit run pairs
Flakiness score0.011
Failures on a commit run again11 of 11 passed in another run of the same commit; 0 failed in every run of it
ActivityOngoing: 11 failures; the longest quiet spell between failures was 950 runs, and the last failure was 150 runs ago.
Duration trend (without retries)-0.0 ms/history run
Timing observations (without retries)2153
Duration × failure correlation+0.03
Failure messages
  • binder_test.go:1757: returned error: selectedNode annotation reset for PVC "provisioned-pvc" ×7
  • binder_test.go:1763: returned bound true ×2
  • binder_test.go:2102: returned error: binding volumes: context deadline exceeded ×2

Tests named in this testcase's failures

The report keeps one record for the whole package; these names come from the failure output (--- FAIL: lines).

TestFailed runsPassed on same commitActivity
TestCheckBindings99 of 9first failed 2,102 runs ago, last 150 runs ago
TestBindPodVolumes22 of 2first failed 2,013 runs ago, last 1,209 runs ago

Failures, newest first

RunSame commit, other runsOther tests failedNamed in output, or message
2105773499783057408
2026-10-01 21:35
36fb98934281
passed in another run (5 of this commit)
noneTestCheckBindings/tolerate-provisioning-pvc-bound-pv-not-found, TestCheckBindings
2104132652159209472
2026-09-27 08:55
6c1c7702cf20
passed in another run (20 of this commit)
noneTestCheckBindings/tolerate-provisioning-pvc-bound-pv-not-found, TestCheckBindings
2089566081931808768
2026-08-18 04:13
c44d2a82ef7f
passed in another run (24 of this commit)
noneTestBindPodVolumes/binding-static-pv-succeeds-after-time, TestBindPodVolumes
2088220450545995776
2026-08-14 11:09
a231bf3f3776
passed in another run (86 of this commit)
1TestCheckBindings/tolerate-provisioning-pvc-bound-pv-not-found, TestCheckBindings
2085267269096574976
2026-08-06 07:31
4f5591ab57b7
passed in another run (10 of this commit)
noneTestCheckBindings/tolerate-provisioning-pvc-bound-pv-not-found, TestCheckBindings
2082058017792069633
2026-07-28 10:58
5f91251764f1
passed in another run (3 of this commit)
noneTestCheckBindings/binding-claimref-uid-empty, TestCheckBindings
2080345967529299968
2026-07-23 17:35
aa94f417962c
passed in another run (9 of this commit)
noneTestCheckBindings/tolerate-provisioning-pvc-bound-pv-not-found, TestCheckBindings
2079963032879894528
2026-07-22 16:14
9c722bc288a7
passed in another run (2 of this commit)
1TestCheckBindings/tolerate-provisioning-pvc-bound-pv-not-found, TestCheckBindings
2077399450455642112
2026-07-15 14:27
ba3578f278d8
passed in another run (3 of this commit)
noneTestCheckBindings/tolerate-provisioning-pvc-bound-pv-not-found, TestCheckBindings
2077184771565293568
2026-07-15 00:14
153eedf9b826
passed in another run (3 of this commit)
noneTestBindPodVolumes/binding-static-pv-succeeds-after-time, TestBindPodVolumes
2075821000427048960
2026-07-11 05:54
843726939e91
passed in another run (36 of this commit)
noneTestCheckBindings/binding-claimref-uid-empty, TestCheckBindings
[sig-storage] k8s.io/kubernetes/pkg/controller/volume/attachdetach.reconciler INTERMITTENT 2083373196622434304 · 2026-08-01 02:04 · fail · a818af18fe29 · Test_Run_OneVolumeDetachOnUnhealthyNodeWithForceDetachOnUnmountDisabled2084105002413985792 · 2026-08-03 02:32 · fail · a818af18fe29 · Test_Run_OneVolumeDetachOnUnhealthyNodeWithForceDetachOnUnmountDisabled2084532427920773120 · 2026-08-04 06:51 · fail · b037c6852709 · Test_Run_OneVolumeDetachOnUnhealthyNodeWithForceDetachOnUnmountDisabled2085053108664143872 · 2026-08-05 17:20 · fail · ec9448ceef13 · Test_Run_OneVolumeDetachOnUnhealthyNodeWithForceDetachOnUnmountDisabled2087134659228995584 · 2026-08-11 11:11 · fail · 8c078bc32e90 · Test_Run_OneVolumeDetachOnUnhealthyNodeWithForceDetachOnUnmountDisabled2088144698597183488 · 2026-08-14 06:07 · fail · a231bf3f3776 · Test_Run_OneVolumeDetachOnUnhealthyNodeWithForceDetachOnUnmountDisabled2090897369800380416 · 2026-08-21 20:23 · fail · e81f39c0e03c · Test_Run_OneVolumeDetachOnUnhealthyNodeWithForceDetachOnUnmountDisabled2102671257194467328 · 2026-09-23 08:08 · fail · cc213a13bd4e · Test_Run_OneVolumeDetachOnOutOfServiceTaintedNode 8 0.37%

[sig-storage] k8s.io/kubernetes/pkg/controller/volume/attachdetach.reconciler

Final failure rate (95% CI)0.37% [0.19%–0.73%] · 8 of 2,153 runs
Usable outcomesruns: 2,153; skipped: 0; excluded: 0
Passed on retry0 (explicit failed attempts before a pass)
Retry exhaustion0 (every recorded attempt failed)
Flip rate0.74% of 2,152 usable consecutive pairs
Same-context rerun disagreement7/305 commit/branch/runner/OS groups; 0.83% of same-commit run pairs
Flakiness score0.008
Failures on a commit run again8 of 8 passed in another run of the same commit; 0 failed in every run of it
ActivityOngoing: 8 failures; the longest quiet spell between failures was 769 runs, and the last failure was 354 runs ago.
Duration trend (without retries)-0.1 ms/history run
Timing observations (without retries)2153
Duration × failure correlation-0.23
Failure messages
  • reconciler_test.go:1291: Expected desiredForceDetachMericCounter to be 5, got 6 ×8

Tests named in this testcase's failures

The report keeps one record for the whole package; these names come from the failure output (--- FAIL: lines).

TestFailed runsPassed on same commitActivity
Test_Run_OneVolumeDetachOnUnhealthyNodeWithForceDetachOnUnmountDisabled77 of 7quiet for 1,124 runs
Test_Run_OneVolumeDetachOnOutOfServiceTaintedNode11 of 1first failed 355 runs ago, last 354 runs ago

Failures, newest first

RunSame commit, other runsOther tests failedNamed in output, or message
2102671257194467328
2026-09-23 08:08
cc213a13bd4e
passed in another run (13 of this commit)
noneTest_Run_OneVolumeDetachOnOutOfServiceTaintedNode
2090897369800380416
2026-08-21 20:23
e81f39c0e03c
passed in another run (115 of this commit)
noneTest_Run_OneVolumeDetachOnUnhealthyNodeWithForceDetachOnUnmountDisabled
2088144698597183488
2026-08-14 06:07
a231bf3f3776
passed in another run (86 of this commit)
noneTest_Run_OneVolumeDetachOnUnhealthyNodeWithForceDetachOnUnmountDisabled
2087134659228995584
2026-08-11 11:11
8c078bc32e90
passed in another run (24 of this commit)
noneTest_Run_OneVolumeDetachOnUnhealthyNodeWithForceDetachOnUnmountDisabled
2085053108664143872
2026-08-05 17:20
ec9448ceef13
passed in another run (19 of this commit)
noneTest_Run_OneVolumeDetachOnUnhealthyNodeWithForceDetachOnUnmountDisabled
2084532427920773120
2026-08-04 06:51
b037c6852709
passed in another run (22 of this commit)
noneTest_Run_OneVolumeDetachOnUnhealthyNodeWithForceDetachOnUnmountDisabled
2084105002413985792
2026-08-03 02:32
a818af18fe29
passed in another run (63 of this commit)
noneTest_Run_OneVolumeDetachOnUnhealthyNodeWithForceDetachOnUnmountDisabled
2083373196622434304
2026-08-01 02:04
a818af18fe29
passed in another run (63 of this commit)
noneTest_Run_OneVolumeDetachOnUnhealthyNodeWithForceDetachOnUnmountDisabled
[sig-api-machinery] k8s.io/client-go/tools.remotecommand INTERMITTENT 2079379011733032960 · 2026-07-21 01:36 · fail · 0ad5530cfdf4 · TestWebSocketClient_MultipleWriteChannels2079578579372347392 · 2026-07-21 14:46 · fail · bc5b2109f5dd · TestWebSocketClient_HeartbeatTimeout2097288107383590912 · 2026-09-08 11:37 · fail · e826ccd6485f · TestWebSocketClient_MultipleWriteChannels2098400950220754944 · 2026-09-11 13:19 · fail · a6d4708e8169 · TestWebSocketClient_MultipleWriteChannels2100878168138190848 · 2026-09-18 09:23 · fail · bc32e8eb00ff · TestWebSocketClient_DifferentBufferSizes2103020815594295296 · 2026-09-24 07:17 · fail · 7b4bd5d3773e · TestFallbackClient_SPDYSecondaryNonZeroExitCode2107214761010663424 · 2026-10-05 21:03 · fail · 205d49734150 · TestWebSocketClient_HeartbeatSucceeds 7 0.33%

[sig-api-machinery] k8s.io/client-go/tools.remotecommand

Final failure rate (95% CI)0.33% [0.16%–0.67%] · 7 of 2,153 runs
Usable outcomesruns: 2,153; skipped: 0; excluded: 0
Passed on retry0 (explicit failed attempts before a pass)
Retry exhaustion0 (every recorded attempt failed)
Flip rate0.65% of 2,152 usable consecutive pairs
Same-context rerun disagreement7/305 commit/branch/runner/OS groups; 0.73% of same-commit run pairs
Flakiness score0.007
Failures on a commit run again7 of 7 passed in another run of the same commit; 0 failed in every run of it
ActivityOngoing: 7 failures; the longest quiet spell between failures was 1,148 runs, and the last failure was 55 runs ago.
Duration trend (without retries)+0.0 ms/history run
Timing observations (without retries)2153
Duration × failure correlation-0.21
Failure messages
  • websocket_test.go:617: error on webSocketServerStreams: websocket server finished before becoming ready ×5
  • fallback_test.go:300: An error is expected but got nil. ×1
  • websocket_test.go:1104: client err reading message: read tcp 127.0.0.1:56820->127.0.0.1:38877: i/o timeout ×1

Tests named in this testcase's failures

The report keeps one record for the whole package; these names come from the failure output (--- FAIL: lines).

TestFailed runsPassed on same commitActivity
TestWebSocketClient_MultipleWriteChannels33 of 3first failed 1,870 runs ago, last 634 runs ago
TestFallbackClient_SPDYSecondaryNonZeroExitCode11 of 1first failed 332 runs ago, last 331 runs ago
TestWebSocketClient_DifferentBufferSizes11 of 1first failed 473 runs ago, last 472 runs ago
TestWebSocketClient_HeartbeatSucceeds11 of 1first failed 56 runs ago, last 55 runs ago
TestWebSocketClient_HeartbeatTimeout11 of 1first failed 1,857 runs ago, last 1,856 runs ago

Failures, newest first

RunSame commit, other runsOther tests failedNamed in output, or message
2107214761010663424
2026-10-05 21:03
205d49734150
passed in another run (4 of this commit)
noneTestWebSocketClient_HeartbeatSucceeds
2103020815594295296
2026-09-24 07:17
7b4bd5d3773e
passed in another run (6 of this commit)
noneTestFallbackClient_SPDYSecondaryNonZeroExitCode
2100878168138190848
2026-09-18 09:23
bc32e8eb00ff
passed in another run (3 of this commit)
noneTestWebSocketClient_DifferentBufferSizes
2098400950220754944
2026-09-11 13:19
a6d4708e8169
passed in another run (3 of this commit)
noneTestWebSocketClient_MultipleWriteChannels
2097288107383590912
2026-09-08 11:37
e826ccd6485f
passed in another run (3 of this commit)
noneTestWebSocketClient_MultipleWriteChannels
2079578579372347392
2026-07-21 14:46
bc5b2109f5dd
passed in another run (2 of this commit)
noneTestWebSocketClient_HeartbeatTimeout
2079379011733032960
2026-07-21 01:36
0ad5530cfdf4
passed in another run (3 of this commit)
noneTestWebSocketClient_MultipleWriteChannels
[sig-scheduling] k8s.io/kubernetes/pkg/scheduler/framework.preemption INTERMITTENT 2081233065937473536 · 2026-07-26 04:20 · fail · 24a5b063a5f2 · TestAsyncPreemptionFailure/Failure_with_a_single_victim, TestAsyncPreemptionFailure2086231633098182656 · 2026-08-08 23:23 · fail · 94c136764292 · TestAsyncPreemptionFailure/Failure_in_third_of_three_victims, TestAsyncPreemptionFailure2091996507157827584 · 2026-08-24 21:10 · fail · e81f39c0e03c · TestAsyncPreemptionFailure/Failure_with_a_single_victim_for_composite_pod_group, TestAsyncPreemptionFailure2093187044107882496 · 2026-08-28 04:01 · fail · f883ef07d983 · TestAsyncPreemptionFailure/Failure_with_a_single_victim_for_composite_pod_group, TestAsyncPreemptionFailure2101091575521087488 · 2026-09-18 23:31 · fail · b45823737fff · TestAsyncPreemptionFailure/Failure_in_first_two_of_three_victims, TestAsyncPreemptionFailure2102367252002115584 · 2026-09-22 12:00 · fail · d176e72c54c2 · TestAsyncPreemptionFailure/Failure_in_second_of_three_victims, TestAsyncPreemptionFailure2103661541998989312 · 2026-09-26 01:43 · fail · 701336159635 · TestAsyncPreemptionFailure/Failure_in_second_of_three_victims, TestAsyncPreemptionFailure 7 0.33%

[sig-scheduling] k8s.io/kubernetes/pkg/scheduler/framework.preemption

Final failure rate (95% CI)0.33% [0.16%–0.67%] · 7 of 2,153 runs
Usable outcomesruns: 2,153; skipped: 0; excluded: 0
Passed on retry0 (explicit failed attempts before a pass)
Retry exhaustion0 (every recorded attempt failed)
Flip rate0.65% of 2,152 usable consecutive pairs
Same-context rerun disagreement6/305 commit/branch/runner/OS groups; 0.63% of same-commit run pairs
Flakiness score0.006
Failures on a commit run again6 of 6 passed in another run of the same commit; 0 failed in every run of it; 1 more had no other run
ActivityOngoing: 7 failures; the longest quiet spell between failures was 516 runs, and the last failure was 289 runs ago.
Duration trend (without retries)+1.0 ms/history run
Timing observations (without retries)2153
Duration × failure correlation-0.03
Failure messages
  • executor_test.go:1339: Preemptor activated - wanted: true, got: false ×5
  • executor_test.go:1334: Expected preemptor pod pod2 to be activated, but got map[] ×2

Tests named in this testcase's failures

The report keeps one record for the whole package; these names come from the failure output (--- FAIL: lines).

TestFailed runsPassed on same commitActivity
TestAsyncPreemptionFailure76 of 6first failed 1,749 runs ago, last 289 runs ago

Failures, newest first

RunSame commit, other runsOther tests failedNamed in output, or message
2103661541998989312
2026-09-26 01:43
701336159635
passed in another run (7 of this commit)
noneTestAsyncPreemptionFailure/Failure_in_second_of_three_victims, TestAsyncPreemptionFailure
2102367252002115584
2026-09-22 12:00
d176e72c54c2
passed in another run (2 of this commit)
1TestAsyncPreemptionFailure/Failure_in_second_of_three_victims, TestAsyncPreemptionFailure
2101091575521087488
2026-09-18 23:31
b45823737fff
no other run
noneTestAsyncPreemptionFailure/Failure_in_first_two_of_three_victims, TestAsyncPreemptionFailure
2093187044107882496
2026-08-28 04:01
f883ef07d983
passed in another run (4 of this commit)
noneTestAsyncPreemptionFailure/Failure_with_a_single_victim_for_composite_pod_group, TestAsyncPreemptionFailure
2091996507157827584
2026-08-24 21:10
e81f39c0e03c
passed in another run (115 of this commit)
noneTestAsyncPreemptionFailure/Failure_with_a_single_victim_for_composite_pod_group, TestAsyncPreemptionFailure
2086231633098182656
2026-08-08 23:23
94c136764292
passed in another run (42 of this commit)
noneTestAsyncPreemptionFailure/Failure_in_third_of_three_victims, TestAsyncPreemptionFailure
2081233065937473536
2026-07-26 04:20
24a5b063a5f2
passed in another run (18 of this commit)
noneTestAsyncPreemptionFailure/Failure_with_a_single_victim, TestAsyncPreemptionFailure
[sig-network] k8s.io/kubernetes/pkg/controller/nodeipam/ipam.sync INTERMITTENT 2079517174455603200 · 2026-07-21 10:42 · fail · 098f9786d8f7 · panic: test timed out after 3m0s2085787955032494080 · 2026-08-07 18:00 · fail · b882c60b4023 · panic: test timed out after 3m0s2098035036879065088 · 2026-09-10 13:05 · fail · 6c4be7ebaa50 · panic: test timed out after 3m0s2098279902267576320 · 2026-09-11 05:18 · fail · 9323f719f432 · panic: test timed out after 3m0s2098644771726692352 · 2026-09-12 05:28 · fail · 995680c51b5b · panic: test timed out after 3m0s2102367252002115584 · 2026-09-22 12:00 · fail · d176e72c54c2 · panic: test timed out after 3m0s2105012962136690688 · 2026-09-29 19:13 · fail · fa5423953d48 · panic: test timed out after 3m0s 7 0.33%

[sig-network] k8s.io/kubernetes/pkg/controller/nodeipam/ipam.sync

Final failure rate (95% CI)0.33% [0.16%–0.67%] · 7 of 2,153 runs
Usable outcomesruns: 2,153; skipped: 0; excluded: 0
Passed on retry0 (explicit failed attempts before a pass)
Retry exhaustion0 (every recorded attempt failed)
Flip rate0.65% of 2,152 usable consecutive pairs
Same-context rerun disagreement5/305 commit/branch/runner/OS groups; 0.52% of same-commit run pairs
Flakiness score0.006
Failures on a commit run again5 of 5 passed in another run of the same commit; 0 failed in every run of it; 2 more had no other run
ActivityOngoing: 7 failures; the longest quiet spell between failures was 791 runs, and the last failure was 200 runs ago.
Duration trend (without retries)+0.4 ms/history run
Timing observations (without retries)2153
Duration × failure correlation+1.00
Failure messages
  • panic: test timed out after 3m0s ×7

Failures, newest first

RunSame commit, other runsOther tests failedNamed in output, or message
2105012962136690688
2026-09-29 19:13
fa5423953d48
no other run
nonepanic: test timed out after 3m0s
2102367252002115584
2026-09-22 12:00
d176e72c54c2
passed in another run (2 of this commit)
1panic: test timed out after 3m0s
2098644771726692352
2026-09-12 05:28
995680c51b5b
passed in another run (6 of this commit)
nonepanic: test timed out after 3m0s
2098279902267576320
2026-09-11 05:18
9323f719f432
passed in another run (3 of this commit)
nonepanic: test timed out after 3m0s
2098035036879065088
2026-09-10 13:05
6c4be7ebaa50
passed in another run (2 of this commit)
nonepanic: test timed out after 3m0s
2085787955032494080
2026-08-07 18:00
b882c60b4023
passed in another run (56 of this commit)
nonepanic: test timed out after 3m0s
2079517174455603200
2026-07-21 10:42
098f9786d8f7
no other run
nonepanic: test timed out after 3m0s
[sig-node] k8s.io/dynamic-resource-allocation.resourceslice INTERMITTENT 2075667479224389632 · 2026-07-10 19:44 · fail · d80e87fd22bb · TestControllerSyncPool/multiple-resourceslices-existing-with-different-resource-pool-generation, TestControllerSyncPool2085114514365222912 · 2026-08-05 21:24 · fail · ec9448ceef13 · TestControllerSyncPool/multiple-resourceslices-existing-with-different-resource-pool-generation, TestControllerSyncPool2087945383454969856 · 2026-08-13 16:53 · fail · 52ba90138eb4 · TestControllerSyncPool/multiple-resourceslices-existing-with-different-resource-pool-generation, TestControllerSyncPool2095601980209631232 · 2026-09-03 19:57 · fail · 62a78fd86a6c · TestControllerSyncPool/multiple-resourceslices-existing-with-different-resource-pool-generation, TestControllerSyncPool2101790689141460992 · 2026-09-20 21:49 · fail · 400031d69530 · TestControllerSyncPool/multiple-resourceslices-existing-with-different-resource-pool-generation, TestControllerSyncPool 5 0.23%

[sig-node] k8s.io/dynamic-resource-allocation.resourceslice

Final failure rate (95% CI)0.23% [0.099%–0.54%] · 5 of 2,153 runs
Usable outcomesruns: 2,153; skipped: 0; excluded: 0
Passed on retry0 (explicit failed attempts before a pass)
Retry exhaustion0 (every recorded attempt failed)
Flip rate0.46% of 2,152 usable consecutive pairs
Same-context rerun disagreement5/305 commit/branch/runner/OS groups; 0.52% of same-commit run pairs
Flakiness score0.005
Failures on a commit run again5 of 5 passed in another run of the same commit; 0 failed in every run of it
ActivityOngoing: 5 failures; the longest quiet spell between failures was 616 runs, and the last failure was 412 runs ago.
Duration trend (without retries)+3.9 ms/history run
Timing observations (without retries)2153
Duration × failure correlation-0.03
Failure messages
  • resourceslicecontroller_test.go:1618: Not equal: expected: resourceslice.Stats{NumCreates:1, NumUpdates:0, NumDeletes:3} ×5

Tests named in this testcase's failures

The report keeps one record for the whole package; these names come from the failure output (--- FAIL: lines).

TestFailed runsPassed on same commitActivity
TestControllerSyncPool55 of 5first failed 2,112 runs ago, last 412 runs ago

Failures, newest first

RunSame commit, other runsOther tests failedNamed in output, or message
2101790689141460992
2026-09-20 21:49
400031d69530
passed in another run (29 of this commit)
noneTestControllerSyncPool/multiple-resourceslices-existing-with-different-resource-pool-generation, TestControllerSyncPool
2095601980209631232
2026-09-03 19:57
62a78fd86a6c
passed in another run (4 of this commit)
noneTestControllerSyncPool/multiple-resourceslices-existing-with-different-resource-pool-generation, TestControllerSyncPool
2087945383454969856
2026-08-13 16:53
52ba90138eb4
passed in another run (29 of this commit)
noneTestControllerSyncPool/multiple-resourceslices-existing-with-different-resource-pool-generation, TestControllerSyncPool
2085114514365222912
2026-08-05 21:24
ec9448ceef13
passed in another run (19 of this commit)
noneTestControllerSyncPool/multiple-resourceslices-existing-with-different-resource-pool-generation, TestControllerSyncPool
2075667479224389632
2026-07-10 19:44
d80e87fd22bb
passed in another run (2 of this commit)
noneTestControllerSyncPool/multiple-resourceslices-existing-with-different-resource-pool-generation, TestControllerSyncPool
[sig-api-machinery] k8s.io/client-go.rest INTERMITTENT 2084456321486163968 · 2026-08-04 01:48 · fail · b037c6852709 · TestReconnectBrokenTCP2092561487355711488 · 2026-08-26 10:38 · fail · fbb9a10c7a04 · TestReconnectBrokenTCP2099297329256337408 · 2026-09-14 00:41 · fail · d5cbb79be916 · TestReconnectBrokenTCP2100573752403169280 · 2026-09-17 13:13 · fail · c709d78ba752 · TestReconnectBrokenTCP 4 0.19%

[sig-api-machinery] k8s.io/client-go.rest

Final failure rate (95% CI)0.19% [0.072%–0.48%] · 4 of 2,153 runs
Usable outcomesruns: 2,153; skipped: 0; excluded: 0
Passed on retry0 (explicit failed attempts before a pass)
Retry exhaustion0 (every recorded attempt failed)
Flip rate0.37% of 2,152 usable consecutive pairs
Same-context rerun disagreement4/305 commit/branch/runner/OS groups; 0.42% of same-commit run pairs
Flakiness score0.004
Failures on a commit run again4 of 4 passed in another run of the same commit; 0 failed in every run of it
ActivityOngoing: 4 failures; the longest quiet spell between failures was 520 runs, and the last failure was 491 runs ago.
Duration trend (without retries)+0.0 ms/history run
Timing observations (without retries)2153
Duration × failure correlation-0.02
Failure messages
  • connection_test.go:148: unexpected err: Get "https://127.0.0.1:37583/?timeout=1s": context deadline exceeded ×2
  • connection_test.go:148: unexpected err: Get "https://127.0.0.1:36935/?timeout=1s": context deadline exceeded (Client.Timeout exceeded while awaiting headers) ×1
  • connection_test.go:148: unexpected err: Get "https://127.0.0.1:46865/?timeout=1s": net/http: request canceled while waiting for connection (Client.Timeout exceeded while awaiting headers) ×1

Tests named in this testcase's failures

The report keeps one record for the whole package; these names come from the failure output (--- FAIL: lines).

TestFailed runsPassed on same commitActivity
TestReconnectBrokenTCP44 of 4first failed 1,538 runs ago, last 491 runs ago

Failures, newest first

RunSame commit, other runsOther tests failedNamed in output, or message
2100573752403169280
2026-09-17 13:13
c709d78ba752
passed in another run (3 of this commit)
noneTestReconnectBrokenTCP
2099297329256337408
2026-09-14 00:41
d5cbb79be916
passed in another run (31 of this commit)
noneTestReconnectBrokenTCP
2092561487355711488
2026-08-26 10:38
fbb9a10c7a04
passed in another run (23 of this commit)
noneTestReconnectBrokenTCP
2084456321486163968
2026-08-04 01:48
b037c6852709
passed in another run (22 of this commit)
noneTestReconnectBrokenTCP
[sig-storage] k8s.io/kubernetes/pkg/registry/core/persistentvolume.storage INTERMITTENT 2083754944006983680 · 2026-08-02 03:21 · fail · a818af18fe29 · TestCreate2088220450545995776 · 2026-08-14 11:09 · fail · a231bf3f3776 · TestCreate2102640554708832256 · 2026-09-23 06:06 · fail · cc213a13bd4e · TestCreate2103523884438392832 · 2026-09-25 16:36 · fail · c0bfda37f19c · TestCreate 4 0.19%

[sig-storage] k8s.io/kubernetes/pkg/registry/core/persistentvolume.storage

Final failure rate (95% CI)0.19% [0.072%–0.48%] · 4 of 2,153 runs
Usable outcomesruns: 2,153; skipped: 0; excluded: 0
Passed on retry0 (explicit failed attempts before a pass)
Retry exhaustion0 (every recorded attempt failed)
Flip rate0.37% of 2,152 usable consecutive pairs
Same-context rerun disagreement3/305 commit/branch/runner/OS groups; 0.31% of same-commit run pairs
Flakiness score0.003
Failures on a commit run again3 of 3 passed in another run of the same commit; 0 failed in every run of it; 1 more had no other run
ActivityOngoing: 4 failures; the longest quiet spell between failures was 939 runs, and the last failure was 298 runs ago.
Duration trend (without retries)+0.0 ms/history run
Timing observations (without retries)2153
Duration × failure correlation-0.07
Failure messages
  • logger.go:146: 2026-08-02T03:29:48.047Z ERROR etcd-server setting up serving from embedded etcd failed. {"error": "accept tcp 127.0.0.1:36551: use of closed network connection"} ×4

Tests named in this testcase's failures

The report keeps one record for the whole package; these names come from the failure output (--- FAIL: lines).

TestFailed runsPassed on same commitActivity
TestCreate43 of 3first failed 1,584 runs ago, last 298 runs ago

Failures, newest first

RunSame commit, other runsOther tests failedNamed in output, or message
2103523884438392832
2026-09-25 16:36
c0bfda37f19c
no other run
noneTestCreate
2102640554708832256
2026-09-23 06:06
cc213a13bd4e
passed in another run (13 of this commit)
noneTestCreate
2088220450545995776
2026-08-14 11:09
a231bf3f3776
passed in another run (86 of this commit)
1TestCreate
2083754944006983680
2026-08-02 03:21
a818af18fe29
passed in another run (63 of this commit)
noneTestCreate
[sig-api-machinery] k8s.io/apiserver/pkg/util.proxy INTERMITTENT 2086767673298915328 · 2026-08-10 10:56 · fail · 94c136764292 · TestNewEndpointSliceListerGetter2102138490937413632 · 2026-09-21 20:51 · fail · c5c184571469 · TestStreamTranslator_TTYResizeChannel2107594769474523136 · 2026-10-06 22:12 · fail · 2db452a52f2f · TestStreamTranslator_TTYResizeChannel 3 0.14%

[sig-api-machinery] k8s.io/apiserver/pkg/util.proxy

Final failure rate (95% CI)0.14% [0.047%–0.41%] · 3 of 2,153 runs
Usable outcomesruns: 2,153; skipped: 0; excluded: 0
Passed on retry0 (explicit failed attempts before a pass)
Retry exhaustion0 (every recorded attempt failed)
Flip rate0.28% of 2,152 usable consecutive pairs
Same-context rerun disagreement3/305 commit/branch/runner/OS groups; 0.31% of same-commit run pairs
Flakiness score0.003
Failures on a commit run again3 of 3 passed in another run of the same commit; 0 failed in every run of it
ActivityOngoing: 3 failures; the longest quiet spell between failures was 996 runs, and the last failure was 30 runs ago.
Duration trend (without retries)-0.3 ms/history run
Timing observations (without retries)2153
Duration × failure correlation-0.07
Failure messages
  • streamtranslator_test.go:703: # HELP apiserver_stream_translator_requests_total [ALPHA] Total number of requests that were handled by the StreamTranslatorProxy, which processes streaming RemoteCommand/V5 ×2
  • endpointslice_test.go:136: slices for namespace2/service1 did not match expectation: []*v1.EndpointSlice{ ×1

Tests named in this testcase's failures

The report keeps one record for the whole package; these names come from the failure output (--- FAIL: lines).

TestFailed runsPassed on same commitActivity
TestStreamTranslator_TTYResizeChannel22 of 2first failed 390 runs ago, last 30 runs ago
TestNewEndpointSliceListerGetter11 of 1first failed 1,387 runs ago, last 1,386 runs ago

Failures, newest first

RunSame commit, other runsOther tests failedNamed in output, or message
2107594769474523136
2026-10-06 22:12
2db452a52f2f
passed in another run (2 of this commit)
noneTestStreamTranslator_TTYResizeChannel
2102138490937413632
2026-09-21 20:51
c5c184571469
passed in another run (3 of this commit)
noneTestStreamTranslator_TTYResizeChannel
2086767673298915328
2026-08-10 10:56
94c136764292
passed in another run (42 of this commit)
noneTestNewEndpointSliceListerGetter
[sig-api-machinery] k8s.io/apiserver/pkg/storage.cacher INTERMITTENT 2077721828238823424 · 2026-07-16 11:48 · fail · a0b3d14d2753 · panic: synthetic error2084120101912580096 · 2026-08-03 03:32 · fail · a818af18fe29 · panic: synthetic error2093004085790773248 · 2026-08-27 15:54 · fail · 8f6d5a909bc4 · panic: synthetic error 3 0.14%

[sig-api-machinery] k8s.io/apiserver/pkg/storage.cacher

Final failure rate (95% CI)0.14% [0.047%–0.41%] · 3 of 2,153 runs
Usable outcomesruns: 2,153; skipped: 0; excluded: 0
Passed on retry0 (explicit failed attempts before a pass)
Retry exhaustion0 (every recorded attempt failed)
Flip rate0.28% of 2,152 usable consecutive pairs
Same-context rerun disagreement2/305 commit/branch/runner/OS groups; 0.21% of same-commit run pairs
Flakiness score0.003
Failures on a commit run again2 of 2 passed in another run of the same commit; 0 failed in every run of it; 1 more had no other run
ActivityOngoing: 3 failures; the longest quiet spell between failures was 571 runs, and the last failure was 987 runs ago.
Duration trend (without retries)-2.7 ms/history run
Timing observations (without retries)2153
Duration × failure correlation-0.57
Failure messages
  • panic: synthetic error ×3

Failures, newest first

RunSame commit, other runsOther tests failedNamed in output, or message
2093004085790773248
2026-08-27 15:54
8f6d5a909bc4
no other run
nonepanic: synthetic error
2084120101912580096
2026-08-03 03:32
a818af18fe29
passed in another run (63 of this commit)
nonepanic: synthetic error
2077721828238823424
2026-07-16 11:48
a0b3d14d2753
passed in another run (3 of this commit)
1panic: synthetic error
[sig-api-machinery] k8s.io/client-go/tools.cache INTERMITTENT 2083052072726433792 · 2026-07-31 04:48 · fail · 8e608f6b90ea · Failed2090376683197566976 · 2026-08-20 09:54 · fail · 65bca7cd12f0 · TestNewReflectorWithCustomBackoff/custom_backoff, TestNewReflectorWithCustomBackoff2098126390028144640 · 2026-09-10 19:08 · fail · 47c9a4e78d0b · TestReflectorRespectStoreTransformer/real-fifo, TestReflectorRespectStoreTransformer 3 0.14%

[sig-api-machinery] k8s.io/client-go/tools.cache

Final failure rate (95% CI)0.14% [0.047%–0.41%] · 3 of 2,153 runs
Usable outcomesruns: 2,153; skipped: 0; excluded: 0
Passed on retry0 (explicit failed attempts before a pass)
Retry exhaustion0 (every recorded attempt failed)
Flip rate0.28% of 2,152 usable consecutive pairs
Same-context rerun disagreement2/305 commit/branch/runner/OS groups; 0.21% of same-commit run pairs
Flakiness score0.003
Failures on a commit run again2 of 2 passed in another run of the same commit; 0 failed in every run of it; 1 more had no other run
ActivityOngoing: 3 failures; the longest quiet spell between failures was 504 runs, and the last failure was 652 runs ago.
Duration trend (without retries)-0.1 ms/history run
Timing observations (without retries)2153
Duration × failure correlation-0.01
Failure messages
  • Failed ×1
  • reflector_test.go:884: expected upper bound 300ms, got 341.829148ms ×1
  • reflector_test.go:2265: expected informer to contain 3 objects, but got: 2 ×1

Tests named in this testcase's failures

The report keeps one record for the whole package; these names come from the failure output (--- FAIL: lines).

TestFailed runsPassed on same commitActivity
TestNewReflectorWithCustomBackoff11 of 1first failed 1,158 runs ago, last 1,157 runs ago
TestReflectorRespectStoreTransformer1none to comparefirst failed 653 runs ago, last 652 runs ago

Failures, newest first

RunSame commit, other runsOther tests failedNamed in output, or message
2098126390028144640
2026-09-10 19:08
47c9a4e78d0b
no other run
noneTestReflectorRespectStoreTransformer/real-fifo, TestReflectorRespectStoreTransformer
2090376683197566976
2026-08-20 09:54
65bca7cd12f0
passed in another run (9 of this commit)
noneTestNewReflectorWithCustomBackoff/custom_backoff, TestNewReflectorWithCustomBackoff
2083052072726433792
2026-07-31 04:48
8e608f6b90ea
passed in another run (16 of this commit)
noneFailed
[sig-api-machinery] k8s.io/apimachinery/pkg/util.net INTERMITTENT 2091706457610260480 · 2026-08-24 02:00 · fail · e81f39c0e03c · TestIsConnectionReset2107763132259635200 · 2026-10-07 09:21 · fail · 8b1ee4b67718 · TestIsConnectionReset 2 0.093%

[sig-api-machinery] k8s.io/apimachinery/pkg/util.net

Final failure rate (95% CI)0.093% [0.025%–0.34%] · 2 of 2,153 runs
Usable outcomesruns: 2,153; skipped: 0; excluded: 0
Passed on retry0 (explicit failed attempts before a pass)
Retry exhaustion0 (every recorded attempt failed)
Flip rate0.19% of 2,152 usable consecutive pairs
Same-context rerun disagreement2/305 commit/branch/runner/OS groups; 0.21% of same-commit run pairs
Flakiness score0.002
Failures on a commit run again2 of 2 passed in another run of the same commit; 0 failed in every run of it
Activity2 failures: too few to place.
Duration trend (without retries)-0.0 ms/history run
Timing observations (without retries)2153
Duration × failure correlation-1.00
Failure messages
  • util_test.go:199: expected HTTP2ConnectionLost error, got Get "https://127.0.0.1:46043": read tcp 127.0.0.1:42380->127.0.0.1:46043: read: connection reset by peer ×2

Tests named in this testcase's failures

The report keeps one record for the whole package; these names come from the failure output (--- FAIL: lines).

TestFailed runsPassed on same commitActivity
TestIsConnectionReset22 of 2first failed 1,072 runs ago, last 19 runs ago

Failures, newest first

RunSame commit, other runsOther tests failedNamed in output, or message
2107763132259635200
2026-10-07 09:21
8b1ee4b67718
passed in another run (2 of this commit)
noneTestIsConnectionReset
2091706457610260480
2026-08-24 02:00
e81f39c0e03c
passed in another run (115 of this commit)
noneTestIsConnectionReset
[sig-etcd] k8s.io/apiserver/pkg/storage.etcd3 INTERMITTENT 2078259126579761152 · 2026-07-17 23:23 · fail · 1a4ff29bca9d · TestWatch/NamespaceScopedWatch/namespaced_watch,_request_with_name,_request_without_namespace,_field_selector_with_metadata.name_and_spec.nodeName, TestWatch/NamespaceScopedWatch, TestWatch 1 0.046%

[sig-etcd] k8s.io/apiserver/pkg/storage.etcd3

Final failure rate (95% CI)0.046% [0.0082%–0.26%] · 1 of 2,153 runs
Usable outcomesruns: 2,153; skipped: 0; excluded: 0
Passed on retry0 (explicit failed attempts before a pass)
Retry exhaustion0 (every recorded attempt failed)
Flip rate0.093% of 2,152 usable consecutive pairs
Same-context rerun disagreement1/305 commit/branch/runner/OS groups; 0.10% of same-commit run pairs
Flakiness score0.001
Failures on a commit run again1 of 1 passed in another run of the same commit; 0 failed in every run of it
Activity1 failures: too few to place.
Duration trend (without retries)+2.3 ms/history run
Timing observations (without retries)2153
Duration × failure correlation+0.02
Failure messages
  • utils.go:158: incorrect event:   watch.Event{ ×1

Tests named in this testcase's failures

The report keeps one record for the whole package; these names come from the failure output (--- FAIL: lines).

TestFailed runsPassed on same commitActivity
TestWatch11 of 1first failed 1,943 runs ago, last 1,942 runs ago

Failures, newest first

RunSame commit, other runsOther tests failedNamed in output, or message
2078259126579761152
2026-07-17 23:23
1a4ff29bca9d
passed in another run (3 of this commit)
1TestWatch/NamespaceScopedWatch/namespaced_watch,_request_with_name,_request_without_namespace,_field_selector_with_metadata.name_and_spec.nodeName, TestWatch/NamespaceScopedWatch, TestWatch
[sig-api-machinery] k8s.io/client-go.transport INTERMITTENT 2093095187709431808 · 2026-08-27 21:56 · fail · 55877941cfca · TestCARotationConnectionBehavior_Disabled 1 0.046%

[sig-api-machinery] k8s.io/client-go.transport

Final failure rate (95% CI)0.046% [0.0082%–0.26%] · 1 of 2,153 runs
Usable outcomesruns: 2,153; skipped: 0; excluded: 0
Passed on retry0 (explicit failed attempts before a pass)
Retry exhaustion0 (every recorded attempt failed)
Flip rate0.093% of 2,152 usable consecutive pairs
Same-context rerun disagreement1/305 commit/branch/runner/OS groups; 0.10% of same-commit run pairs
Flakiness score0.001
Failures on a commit run again1 of 1 passed in another run of the same commit; 0 failed in every run of it
Activity1 failures: too few to place.
Duration trend (without retries)-0.0 ms/history run
Timing observations (without retries)2153
Duration × failure correlation-0.70
Failure messages
  • ca_rotation_test.go:393: Failed to re-claim the same server address: listen tcp 127.0.0.1:46557: bind: address already in use ×1

Tests named in this testcase's failures

The report keeps one record for the whole package; these names come from the failure output (--- FAIL: lines).

TestFailed runsPassed on same commitActivity
TestCARotationConnectionBehavior_Disabled11 of 1first failed 982 runs ago, last 981 runs ago

Failures, newest first

RunSame commit, other runsOther tests failedNamed in output, or message
2093095187709431808
2026-08-27 21:56
55877941cfca
passed in another run (2 of this commit)
noneTestCARotationConnectionBehavior_Disabled
[sig-network] k8s.io/kubernetes/pkg/controller.endpoint INTERMITTENT 2087563741628469248 · 2026-08-12 15:40 · fail · 52ba90138eb4 · TestMultipleServiceChanges 1 0.046%

[sig-network] k8s.io/kubernetes/pkg/controller.endpoint

Final failure rate (95% CI)0.046% [0.0082%–0.26%] · 1 of 2,153 runs
Usable outcomesruns: 2,153; skipped: 0; excluded: 0
Passed on retry0 (explicit failed attempts before a pass)
Retry exhaustion0 (every recorded attempt failed)
Flip rate0.093% of 2,152 usable consecutive pairs
Same-context rerun disagreement1/305 commit/branch/runner/OS groups; 0.10% of same-commit run pairs
Flakiness score0.001
Failures on a commit run again1 of 1 passed in another run of the same commit; 0 failed in every run of it
Activity1 failures: too few to place.
Duration trend (without retries)-0.0 ms/history run
Timing observations (without retries)2153
Duration × failure correlation-0.09
Failure messages
  • testing.go:1712: race detected during execution of test ×1

Tests named in this testcase's failures

The report keeps one record for the whole package; these names come from the failure output (--- FAIL: lines).

TestFailed runsPassed on same commitActivity
TestMultipleServiceChanges11 of 1first failed 1,337 runs ago, last 1,336 runs ago

Failures, newest first

RunSame commit, other runsOther tests failedNamed in output, or message
2087563741628469248
2026-08-12 15:40
52ba90138eb4
passed in another run (29 of this commit)
noneTestMultipleServiceChanges
k8s.io/kubernetes/pkg/registry/core/secret.storage INTERMITTENT 2084425872688812032 · 2026-08-03 23:47 · fail · b037c6852709 · TestWatch 1 0.046%

k8s.io/kubernetes/pkg/registry/core/secret.storage

Final failure rate (95% CI)0.046% [0.0082%–0.26%] · 1 of 2,153 runs
Usable outcomesruns: 2,153; skipped: 0; excluded: 0
Passed on retry0 (explicit failed attempts before a pass)
Retry exhaustion0 (every recorded attempt failed)
Flip rate0.093% of 2,152 usable consecutive pairs
Same-context rerun disagreement1/305 commit/branch/runner/OS groups; 0.10% of same-commit run pairs
Flakiness score0.001
Failures on a commit run again1 of 1 passed in another run of the same commit; 0 failed in every run of it
Activity1 failures: too few to place.
Duration trend (without retries)+0.0 ms/history run
Timing observations (without retries)2153
Duration × failure correlation-0.04
Failure messages
  • logger.go:146: 2026-08-03T23:56:14.802Z ERROR etcd-server setting up serving from embedded etcd failed. {"error": "accept tcp 127.0.0.1:36199: use of closed network connection"} ×1

Tests named in this testcase's failures

The report keeps one record for the whole package; these names come from the failure output (--- FAIL: lines).

TestFailed runsPassed on same commitActivity
TestWatch11 of 1first failed 1,540 runs ago, last 1,539 runs ago

Failures, newest first

RunSame commit, other runsOther tests failedNamed in output, or message
2084425872688812032
2026-08-03 23:47
b037c6852709
passed in another run (22 of this commit)
noneTestWatch
[sig-network] k8s.io/kubernetes/pkg/proxy.localnodeportproxy INTERMITTENT 2103082222922764288 · 2026-09-24 11:21 · fail · f341cb461861 · TestSyncNodePorts_ListenersGaugeReflectsActiveCount 1 0.054%

[sig-network] k8s.io/kubernetes/pkg/proxy.localnodeportproxy

Final failure rate (95% CI)0.054% [0.0095%–0.30%] · 1 of 1,855 runs
Usable outcomesruns: 1,855; skipped: 0; excluded: 0
Passed on retry0 (explicit failed attempts before a pass)
Retry exhaustion0 (every recorded attempt failed)
Flip rate0.11% of 1,854 usable consecutive pairs
Same-context rerun disagreement0/248 commit/branch/runner/OS groups; 0% of same-commit run pairs
Flakiness score0.001
Activity1 failures: too few to place.
Duration trend (without retries)+0.0 ms/history run
Timing observations (without retries)1855
Duration × failure correlation-0.61
Failure messages
  • proxy_test.go:662: After adding 2 listeners: gauge = 1, want 2 ×1

Tests named in this testcase's failures

The report keeps one record for the whole package; these names come from the failure output (--- FAIL: lines).

TestFailed runsPassed on same commitActivity
TestSyncNodePorts_ListenersGaugeReflectsActiveCount1none to comparefirst failed 328 runs ago, last 327 runs ago

Failures, newest first

RunSame commit, other runsOther tests failedNamed in output, or message
2103082222922764288
2026-09-24 11:21
f341cb461861
no other run
noneTestSyncNodePorts_ListenersGaugeReflectsActiveCount
[sig-api-machinery] k8s.io/client-go.kubernetes_test INTERMITTENT 2102701960875479040 · 2026-09-23 10:10 · fail · 8011a4bf8153 · TestWatchListSemanticsSimple 1 0.046%

[sig-api-machinery] k8s.io/client-go.kubernetes_test

Final failure rate (95% CI)0.046% [0.0082%–0.26%] · 1 of 2,153 runs
Usable outcomesruns: 2,153; skipped: 0; excluded: 0
Passed on retry0 (explicit failed attempts before a pass)
Retry exhaustion0 (every recorded attempt failed)
Flip rate0.093% of 2,152 usable consecutive pairs
Same-context rerun disagreement0/305 commit/branch/runner/OS groups; 0% of same-commit run pairs
Flakiness score0.001
Activity1 failures: too few to place.
Duration trend (without retries)+0.0 ms/history run
Timing observations (without retries)2153
Duration × failure correlation-0.36
Failure messages
  • clientset_test.go:59: expected a watch request, params: map[] ×1

Tests named in this testcase's failures

The report keeps one record for the whole package; these names come from the failure output (--- FAIL: lines).

TestFailed runsPassed on same commitActivity
TestWatchListSemanticsSimple1none to comparefirst failed 353 runs ago, last 352 runs ago

Failures, newest first

RunSame commit, other runsOther tests failedNamed in output, or message
2102701960875479040
2026-09-23 10:10
8011a4bf8153
no other run
noneTestWatchListSemanticsSimple
[sig-api-machinery] k8s.io/client-go/tools.watch INTERMITTENT 2094749857896992768 · 2026-09-01 11:31 · fail · deb43fc79d18 · panic: test timed out after 3m0s 1 0.046%

[sig-api-machinery] k8s.io/client-go/tools.watch

Final failure rate (95% CI)0.046% [0.0082%–0.26%] · 1 of 2,153 runs
Usable outcomesruns: 2,153; skipped: 0; excluded: 0
Passed on retry0 (explicit failed attempts before a pass)
Retry exhaustion0 (every recorded attempt failed)
Flip rate0.093% of 2,152 usable consecutive pairs
Same-context rerun disagreement0/305 commit/branch/runner/OS groups; 0% of same-commit run pairs
Flakiness score0.001
Activity1 failures: too few to place.
Duration trend (without retries)+0.0 ms/history run
Timing observations (without retries)2153
Duration × failure correlation+1.00
Failure messages
  • panic: test timed out after 3m0s ×1

Failures, newest first

RunSame commit, other runsOther tests failedNamed in output, or message
2094749857896992768
2026-09-01 11:31
deb43fc79d18
no other run
nonepanic: test timed out after 3m0s
[sig-api-machinery] k8s.io/apiserver/pkg/storage/storagebackend.factory QUIET 2075100112496889856 · 2026-07-09 06:10 · fail · 1460c265d5b0 · TestTimeTravelHealthcheck2 consecutive runs, fail · first: 2075529316472459264 · 2026-07-10 10:35 · fail · 0fe889a76062 · TestTimeTravelHealthcheck · last: 20755446778256465922076525896495271936 · 2026-07-13 04:35 · fail · ef2545689899 · TestTimeTravelHealthcheck2076832175914749952 · 2026-07-14 00:52 · fail · 6f9df07ec448 · TestTimeTravelHealthcheck2 consecutive runs, fail · first: 2077031516826767360 · 2026-07-14 14:05 · fail · b1206c60632c · TestTimeTravelHealthcheck · last: 20770468605596835842077737178078646272 · 2026-07-16 12:49 · fail · a0b3d14d2753 · TestTimeTravelHealthcheck2078213062036295680 · 2026-07-17 20:20 · fail · 566951ae3c0a · TestTimeTravelHealthcheck2 consecutive runs, fail · first: 2078980378214797312 · 2026-07-19 23:09 · fail · 3d3f9b2f4665 · TestTimeTravelHealthcheck · last: 20789957295687639042079670677815693312 · 2026-07-21 20:52 · fail · c6977342eb55 · TestTimeTravelHealthcheck2079794179591901184 · 2026-07-22 05:03 · fail · 39c618b5c30c · TestTimeTravelHealthcheck2080575984582529024 · 2026-07-24 08:49 · fail · 32385309d3ad · TestTimeTravelHealthcheck2080820850717626368 · 2026-07-25 01:04 · fail · 2a5a1c06c4bb · TestTimeTravelHealthcheck2081386327420440576 · 2026-07-26 14:29 · fail · 752b88759ecf · TestTimeTravelHealthcheck2081706442968010752 · 2026-07-27 11:41 · fail · 752b88759ecf · TestTimeTravelHealthcheck2082502193088303104 · 2026-07-29 16:23 · fail · 7fbcad5e8ec3 · TestTimeTravelHealthcheck2082624000327946240 · 2026-07-30 00:27 · fail · 6fd104974027 · TestTimeTravelHealthcheck2082792110611763200 · 2026-07-30 11:37 · fail · 6fd104974027 · TestTimeTravelHealthcheck2083159532254531584 · 2026-07-31 11:55 · fail · 8e608f6b90ea · TestTimeTravelHealthcheck2083251389319876609 · 2026-07-31 18:01 · fail · 4d6f7e186ca4 · TestTimeTravelHealthcheck2083556632976953344 · 2026-08-01 14:13 · fail · a818af18fe29 · TestTimeTravelHealthcheck2 consecutive runs, fail · first: 2084288971810017280 · 2026-08-03 14:43 · fail · b037c6852709 · TestTimeTravelHealthcheck · last: 20843043208906711042085282372562980864 · 2026-08-06 08:31 · fail · 4f5591ab57b7 · TestTimeTravelHealthcheck2085497287139659776 · 2026-08-06 22:45 · fail · b882c60b4023 · TestTimeTravelHealthcheck2085772604068597760 · 2026-08-07 17:00 · fail · b882c60b4023 · TestTimeTravelHealthcheck2086630270382903296 · 2026-08-10 01:47 · fail · 94c136764292 · TestTimeTravelHealthcheck2086660967080398848 · 2026-08-10 03:49 · fail · 94c136764292 · TestTimeTravelHealthcheck2086919929042309120 · 2026-08-10 20:58 · fail · 8c078bc32e90 · TestTimeTravelHealthcheck2087058088212303872 · 2026-08-11 06:07 · fail · 8c078bc32e90 · TestTimeTravelHealthcheck2087440931442659328 · 2026-08-12 07:28 · fail · d244fad12002 · TestTimeTravelHealthcheck2087655220170461184 · 2026-08-12 21:40 · fail · 52ba90138eb4 · TestTimeTravelHealthcheck2 consecutive runs, fail · first: 2088648778826387456 · 2026-08-15 15:27 · fail · a231bf3f3776 · TestTimeTravelHealthcheck · last: 20886641265690583042089291519411359744 · 2026-08-17 10:01 · fail · a231bf3f3776 · TestTimeTravelHealthcheck2089398472816988160 · 2026-08-17 17:06 · fail · c44d2a82ef7f · TestTimeTravelHealthcheck2091218485555236864 · 2026-08-22 17:39 · fail · e81f39c0e03c · TestTimeTravelHealthcheck2092470137146839040 · 2026-08-26 04:32 · fail · fbb9a10c7a04 · TestTimeTravelHealthcheck2094386206631530496 · 2026-08-31 11:26 · fail · 0040a112457d · TestTimeTravelHealthcheck2094658755265302528 · 2026-09-01 05:29 · fail · 9f351cb94357 · TestTimeTravelHealthcheck2094780560005140480 · 2026-09-01 13:33 · fail · 526dda45d8ed · TestTimeTravelHealthcheck2095084061872623616 · 2026-09-02 09:39 · fail · ca0942e6fbf0 · TestTimeTravelHealthcheck 44 2.0%

[sig-api-machinery] k8s.io/apiserver/pkg/storage/storagebackend.factory

Final failure rate (95% CI)2.0% [1.5%–2.7%] · 44 of 2,153 runs
Usable outcomesruns: 2,153; skipped: 0; excluded: 0
Passed on retry0 (explicit failed attempts before a pass)
Retry exhaustion0 (every recorded attempt failed)
Flip rate3.6% of 2,152 usable consecutive pairs
Same-context rerun disagreement31/305 commit/branch/runner/OS groups; 4.1% of same-commit run pairs
Flakiness score0.039
Failures on a commit run again41 of 43 passed in another run of the same commit; 2 failed in every run of it; 1 more had no other run
ActivityQuiet: 44 failures in 39 separate stretches; the longest quiet spell between failures was 125 runs, and it has now been 850 runs (6.8 times as long). The burst is over; this does not say it cannot return, or why it stopped.
Duration trend (without retries)+0.0 ms/history run
Timing observations (without retries)2153
Duration × failure correlation-0.18
Failure messages
  • factory_test.go:441: healthcheck() called etcd 1 times, expected only two calls ×44

Tests named in this testcase's failures

The report keeps one record for the whole package; these names come from the failure output (--- FAIL: lines).

TestFailed runsPassed on same commitActivity
TestTimeTravelHealthcheck4441 of 43quiet for 850 runs

Failures, newest first

RunSame commit, other runsOther tests failedNamed in output, or message
2095084061872623616
2026-09-02 09:39
ca0942e6fbf0
passed in another run (2 of this commit)
noneTestTimeTravelHealthcheck
2094780560005140480
2026-09-01 13:33
526dda45d8ed
passed in another run (4 of this commit)
noneTestTimeTravelHealthcheck
2094658755265302528
2026-09-01 05:29
9f351cb94357
passed in another run (5 of this commit)
noneTestTimeTravelHealthcheck
2094386206631530496
2026-08-31 11:26
0040a112457d
passed in another run (3 of this commit)
noneTestTimeTravelHealthcheck
2092470137146839040
2026-08-26 04:32
fbb9a10c7a04
passed in another run (23 of this commit)
noneTestTimeTravelHealthcheck
2091218485555236864
2026-08-22 17:39
e81f39c0e03c
passed in another run (115 of this commit)
noneTestTimeTravelHealthcheck
2089398472816988160
2026-08-17 17:06
c44d2a82ef7f
passed in another run (24 of this commit)
noneTestTimeTravelHealthcheck
2089291519411359744
2026-08-17 10:01
a231bf3f3776
passed in another run (86 of this commit)
noneTestTimeTravelHealthcheck
2088664126569058304
2026-08-15 16:28
a231bf3f3776
passed in another run (86 of this commit)
noneTestTimeTravelHealthcheck
2088648778826387456
2026-08-15 15:27
a231bf3f3776
passed in another run (86 of this commit)
noneTestTimeTravelHealthcheck
2087655220170461184
2026-08-12 21:40
52ba90138eb4
passed in another run (29 of this commit)
noneTestTimeTravelHealthcheck
2087440931442659328
2026-08-12 07:28
d244fad12002
passed in another run (13 of this commit)
noneTestTimeTravelHealthcheck
2087058088212303872
2026-08-11 06:07
8c078bc32e90
passed in another run (24 of this commit)
noneTestTimeTravelHealthcheck
2086919929042309120
2026-08-10 20:58
8c078bc32e90
passed in another run (24 of this commit)
noneTestTimeTravelHealthcheck
2086660967080398848
2026-08-10 03:49
94c136764292
passed in another run (42 of this commit)
noneTestTimeTravelHealthcheck
2086630270382903296
2026-08-10 01:47
94c136764292
passed in another run (42 of this commit)
noneTestTimeTravelHealthcheck
2085772604068597760
2026-08-07 17:00
b882c60b4023
passed in another run (56 of this commit)
noneTestTimeTravelHealthcheck
2085497287139659776
2026-08-06 22:45
b882c60b4023
passed in another run (56 of this commit)
noneTestTimeTravelHealthcheck
2085282372562980864
2026-08-06 08:31
4f5591ab57b7
passed in another run (10 of this commit)
noneTestTimeTravelHealthcheck
2084304320890671104
2026-08-03 15:44
b037c6852709
passed in another run (22 of this commit)
noneTestTimeTravelHealthcheck
2084288971810017280
2026-08-03 14:43
b037c6852709
passed in another run (22 of this commit)
noneTestTimeTravelHealthcheck
2083556632976953344
2026-08-01 14:13
a818af18fe29
passed in another run (63 of this commit)
noneTestTimeTravelHealthcheck
2083251389319876609
2026-07-31 18:01
4d6f7e186ca4
no other run
noneTestTimeTravelHealthcheck
2083159532254531584
2026-07-31 11:55
8e608f6b90ea
passed in another run (16 of this commit)
1TestTimeTravelHealthcheck
2082792110611763200
2026-07-30 11:37
6fd104974027
passed in another run (16 of this commit)
noneTestTimeTravelHealthcheck
2082624000327946240
2026-07-30 00:27
6fd104974027
passed in another run (16 of this commit)
noneTestTimeTravelHealthcheck
2082502193088303104
2026-07-29 16:23
7fbcad5e8ec3
passed in another run (3 of this commit)
noneTestTimeTravelHealthcheck
2081706442968010752
2026-07-27 11:41
752b88759ecf
passed in another run (28 of this commit)
noneTestTimeTravelHealthcheck
2081386327420440576
2026-07-26 14:29
752b88759ecf
passed in another run (28 of this commit)
noneTestTimeTravelHealthcheck
2080820850717626368
2026-07-25 01:04
2a5a1c06c4bb
passed in another run (17 of this commit)
noneTestTimeTravelHealthcheck
2080575984582529024
2026-07-24 08:49
32385309d3ad
passed in another run (5 of this commit)
noneTestTimeTravelHealthcheck
2079794179591901184
2026-07-22 05:03
39c618b5c30c
passed in another run (2 of this commit)
1TestTimeTravelHealthcheck
2079670677815693312
2026-07-21 20:52
c6977342eb55
passed in another run (2 of this commit)
1TestTimeTravelHealthcheck
2078995729568763904
2026-07-20 00:10
3d3f9b2f4665
passed in another run (7 of this commit)
noneTestTimeTravelHealthcheck
2078980378214797312
2026-07-19 23:09
3d3f9b2f4665
passed in another run (7 of this commit)
noneTestTimeTravelHealthcheck
2078213062036295680
2026-07-17 20:20
566951ae3c0a
passed in another run (4 of this commit)
1TestTimeTravelHealthcheck
2077737178078646272
2026-07-16 12:49
a0b3d14d2753
passed in another run (3 of this commit)
noneTestTimeTravelHealthcheck
2077046860559683584
2026-07-14 15:06
b1206c60632c
failed in every run (2 of this commit)
noneTestTimeTravelHealthcheck
2077031516826767360
2026-07-14 14:05
b1206c60632c
failed in every run (2 of this commit)
noneTestTimeTravelHealthcheck
2076832175914749952
2026-07-14 00:52
6f9df07ec448
passed in another run (9 of this commit)
noneTestTimeTravelHealthcheck

Showing the latest 40 of 44 failures; --json has every one.

[sig-node] k8s.io/kubernetes/pkg/kubelet.podcertificate QUIET 2077261528616144896 · 2026-07-15 05:19 · fail · 17db279a2dfd · TestFullFlow2077568304754462720 · 2026-07-16 01:38 · fail · 1b4e48f52199 · TestFullFlow2077691115514892288 · 2026-07-16 09:46 · fail · 7e8950f1ec18 · TestFullFlow2077936748528144384 · 2026-07-17 02:02 · fail · 6d5610685c55 · TestFullFlow2078213062036295680 · 2026-07-17 20:20 · fail · 566951ae3c0a · TestFullFlow2078550802254794752 · 2026-07-18 18:42 · fail · fdccdc5b4028 · TestFullFlow2078627549369339904 · 2026-07-18 23:47 · fail · fdccdc5b4028 · TestFullFlow2078658251607511040 · 2026-07-19 01:49 · fail · 1999683eee27 · TestFullFlow2079210151025315840 · 2026-07-20 14:22 · fail · 2248808797c2 · TestFullFlow2079440425822720000 · 2026-07-21 05:37 · fail · b9bca8bd5b0d · TestFullFlow 10 0.46%

[sig-node] k8s.io/kubernetes/pkg/kubelet.podcertificate

Final failure rate (95% CI)0.46% [0.25%–0.85%] · 10 of 2,153 runs
Usable outcomesruns: 2,153; skipped: 0; excluded: 0
Passed on retry0 (explicit failed attempts before a pass)
Retry exhaustion0 (every recorded attempt failed)
Flip rate0.93% of 2,152 usable consecutive pairs
Same-context rerun disagreement8/305 commit/branch/runner/OS groups; 0.92% of same-commit run pairs
Flakiness score0.009
Failures on a commit run again9 of 9 passed in another run of the same commit; 0 failed in every run of it; 1 more had no other run
ActivityQuiet: 10 failures; the longest quiet spell between failures was 35 runs, and it has now been 1,865 runs (53.3 times as long). The burst is over; this does not say it cannot return, or why it stopped.
Duration trend (without retries)+0.2 ms/history run
Timing observations (without retries)2153
Duration × failure correlation-0.36
Failure messages
  • podcertificatemanager_test.go:613: Error while waiting for podcertificate manager to return valid credentials: credential bundle is not issued yet ×10

Tests named in this testcase's failures

The report keeps one record for the whole package; these names come from the failure output (--- FAIL: lines).

TestFailed runsPassed on same commitActivity
TestFullFlow109 of 9quiet for 1,865 runs

Failures, newest first

RunSame commit, other runsOther tests failedNamed in output, or message
2079440425822720000
2026-07-21 05:37
b9bca8bd5b0d
passed in another run (2 of this commit)
noneTestFullFlow
2079210151025315840
2026-07-20 14:22
2248808797c2
no other run
noneTestFullFlow
2078658251607511040
2026-07-19 01:49
1999683eee27
passed in another run (3 of this commit)
noneTestFullFlow
2078627549369339904
2026-07-18 23:47
fdccdc5b4028
passed in another run (9 of this commit)
noneTestFullFlow
2078550802254794752
2026-07-18 18:42
fdccdc5b4028
passed in another run (9 of this commit)
noneTestFullFlow
2078213062036295680
2026-07-17 20:20
566951ae3c0a
passed in another run (4 of this commit)
1TestFullFlow
2077936748528144384
2026-07-17 02:02
6d5610685c55
passed in another run (4 of this commit)
noneTestFullFlow
2077691115514892288
2026-07-16 09:46
7e8950f1ec18
passed in another run (6 of this commit)
noneTestFullFlow
2077568304754462720
2026-07-16 01:38
1b4e48f52199
passed in another run (5 of this commit)
noneTestFullFlow
2077261528616144896
2026-07-15 05:19
17db279a2dfd
passed in another run (4 of this commit)
noneTestFullFlow
[sig-node] k8s.io/kubernetes/pkg/kubelet/volumemanager.reconciler QUIET 2076755417144233984 · 2026-07-13 19:48 · fail · 4b502f08714b · TestReconstructedVolumeShouldUnmountSucceedAfterSetupFailed2077338285436309504 · 2026-07-15 10:24 · fail · 613c65425e66 · TestReconstructedVolumeShouldUnmountSucceedAfterSetupFailed2078918973050589184 · 2026-07-19 19:05 · fail · a0cd688068b9 · TestReconstructedVolumeShouldUnmountSucceedAfterSetupFailed2080606686107668480 · 2026-07-24 10:51 · fail · 32385309d3ad · TestReconstructedVolumeShouldUnmountSucceedAfterSetupFailed2081492783515832320 · 2026-07-26 21:32 · fail · 752b88759ecf · TestReconstructedVolumeShouldUnmountSucceedAfterSetupFailed2082241724805025792 · 2026-07-28 23:08 · fail · 7c2b6c32644a · TestReconstructedVolumeShouldUnmountSucceedAfterSetupFailed2082379387155517440 · 2026-07-29 08:15 · fail · 7c2b6c32644a · TestReconstructedVolumeShouldUnmountSucceedAfterSetupFailed2083159532254531584 · 2026-07-31 11:55 · fail · 8e608f6b90ea · TestReconstructedVolumeShouldUnmountSucceedAfterSetupFailed 8 0.37%

[sig-node] k8s.io/kubernetes/pkg/kubelet/volumemanager.reconciler

Final failure rate (95% CI)0.37% [0.19%–0.73%] · 8 of 2,153 runs
Usable outcomesruns: 2,153; skipped: 0; excluded: 0
Passed on retry0 (explicit failed attempts before a pass)
Retry exhaustion0 (every recorded attempt failed)
Flip rate0.74% of 2,152 usable consecutive pairs
Same-context rerun disagreement5/305 commit/branch/runner/OS groups; 0.61% of same-commit run pairs
Flakiness score0.007
Failures on a commit run again6 of 6 passed in another run of the same commit; 0 failed in every run of it; 2 more had no other run
ActivityQuiet: 8 failures; the longest quiet spell between failures was 109 runs, and it has now been 1,622 runs (14.9 times as long). The burst is over; this does not say it cannot return, or why it stopped.
Duration trend (without retries)-0.1 ms/history run
Timing observations (without retries)2153
Duration × failure correlation+0.68
Failure messages
  • reconciler_test.go:2033: Timed out waiting for pod "pod1uid" to be unmount from volume "fake-plugin/pv". ×8

Tests named in this testcase's failures

The report keeps one record for the whole package; these names come from the failure output (--- FAIL: lines).

TestFailed runsPassed on same commitActivity
TestReconstructedVolumeShouldUnmountSucceedAfterSetupFailed86 of 6quiet for 1,622 runs

Failures, newest first

RunSame commit, other runsOther tests failedNamed in output, or message
2083159532254531584
2026-07-31 11:55
8e608f6b90ea
passed in another run (16 of this commit)
1TestReconstructedVolumeShouldUnmountSucceedAfterSetupFailed
2082379387155517440
2026-07-29 08:15
7c2b6c32644a
passed in another run (15 of this commit)
noneTestReconstructedVolumeShouldUnmountSucceedAfterSetupFailed
2082241724805025792
2026-07-28 23:08
7c2b6c32644a
passed in another run (15 of this commit)
noneTestReconstructedVolumeShouldUnmountSucceedAfterSetupFailed
2081492783515832320
2026-07-26 21:32
752b88759ecf
passed in another run (28 of this commit)
noneTestReconstructedVolumeShouldUnmountSucceedAfterSetupFailed
2080606686107668480
2026-07-24 10:51
32385309d3ad
passed in another run (5 of this commit)
noneTestReconstructedVolumeShouldUnmountSucceedAfterSetupFailed
2078918973050589184
2026-07-19 19:05
a0cd688068b9
no other run
noneTestReconstructedVolumeShouldUnmountSucceedAfterSetupFailed
2077338285436309504
2026-07-15 10:24
613c65425e66
no other run
noneTestReconstructedVolumeShouldUnmountSucceedAfterSetupFailed
2076755417144233984
2026-07-13 19:48
4b502f08714b
passed in another run (5 of this commit)
noneTestReconstructedVolumeShouldUnmountSucceedAfterSetupFailed
[sig-node] k8s.io/kubernetes/pkg/kubelet.kuberuntime QUIET 2 consecutive runs, fail · first: 2079670677815693312 · 2026-07-21 20:52 · fail · c6977342eb55 · TestComputePodActionsWithContainerRestartRules/resize_of_a_running_non-sidecar_init_container, TestComputePodActionsWithContainerRestartRules/no_init_containers_have_been_started;_start_the_first_one, TestComputePodActionsWithContainerRestartRules · last: 20796862070668697602079717425376399360 · 2026-07-21 23:57 · fail · c59911870d64 · TestComputePodActionsWithContainerRestartRules/resize_of_a_running_non-sidecar_init_container, TestComputePodActionsWithContainerRestartRules/no_init_containers_have_been_started;_start_the_first_one, TestComputePodActionsWithContainerRestartRules4 consecutive runs, fail · first: 2079794179591901184 · 2026-07-22 05:03 · fail · 39c618b5c30c · TestComputePodActionsWithInitAndEphemeralContainers/no_init_containers_have_been_started;_start_the_first_one, TestComputePodActionsWithInitAndEphemeralContainers/resize_of_a_running_non-sidecar_init_container, TestComputePodActionsWithInitAndEphemeralContainers · last: 20798402042810900482079901622682521600 · 2026-07-22 12:09 · fail · 373c9622bfd9 · TestComputePodActionsWithContainerRestartRules/no_init_containers_have_been_started;_start_the_first_one, TestComputePodActionsWithContainerRestartRules/resize_of_a_running_non-sidecar_init_container, TestComputePodActionsWithContainerRestartRules 8 0.37%

[sig-node] k8s.io/kubernetes/pkg/kubelet.kuberuntime

Final failure rate (95% CI)0.37% [0.19%–0.73%] · 8 of 2,153 runs
Usable outcomesruns: 2,153; skipped: 0; excluded: 0
Passed on retry0 (explicit failed attempts before a pass)
Retry exhaustion0 (every recorded attempt failed)
Flip rate0.37% of 2,152 usable consecutive pairs
Same-context rerun disagreement3/305 commit/branch/runner/OS groups; 0.31% of same-commit run pairs
Flakiness score0.004
Failures on a commit run again3 of 5 passed in another run of the same commit; 2 failed in every run of it; 3 more had no other run
ActivityQuiet: 8 failures in 4 separate stretches; the longest quiet spell between failures was 4 runs, and it has now been 1,835 runs (458.8 times as long). The burst is over; this does not say it cannot return, or why it stopped.
Duration trend (without retries)-1.2 ms/history run
Timing observations (without retries)2153
Duration × failure correlation-0.05
Failure messages
  • kuberuntime_manager_test.go:1891: Not equal: expected: &kuberuntime.podActions{KillPod:false, CreateSandbox:false, SandboxID:"sandboxID", Attempt:0x0, InitContainersToStart:[]int{0}, ContainersToStart:[]int{}, ContainersToKill:map[container.ContainerID]kuberuntime.containerToKillInfo{}, EphemeralContainersToStart:[]int(nil), ContainersToUpdate:map[v1.ResourceName][]kuberuntime.containerToUpdateInfo{}, VolumesToUpsize:[]v1.Volume(nil), VolumesToDownsize:[]v1.Volume(nil), UpdatePodResources:false, ×5
  • kuberuntime_manager_test.go:1891: Not equal: expected: &kuberuntime.podActions{KillPod:false, CreateSandbox:false, SandboxID:"sandboxID", Attempt:0x0, InitContainersToStart:[]int(nil), ContainersToStart:[]int{}, ContainersToKill:map[container.ContainerID]kuberuntime.containerToKillInfo{}, EphemeralContainersToStart:[]int(nil), ContainersToUpdate:map[v1.ResourceName][]kuberuntime.containerToUpdateInfo{"cpu":[]kuberuntime.containerToUpdateInfo{kuberuntime.containerToUpdateInfo{container:(*v1.Conta ×3

Tests named in this testcase's failures

The report keeps one record for the whole package; these names come from the failure output (--- FAIL: lines).

TestFailed runsPassed on same commitActivity
TestComputePodActionsWithContainerRestartRules43 of 4quiet for 1,835 runs
TestComputePodActionsWithInitAndEphemeralContainers20 of 1first failed 1,843 runs ago, last 1,839 runs ago
TestComputePodActionsForRestartAllContainers1none to comparefirst failed 1,841 runs ago, last 1,840 runs ago
TestComputePodActionsWithInitContainers1none to comparefirst failed 1,850 runs ago, last 1,849 runs ago

Failures, newest first

RunSame commit, other runsOther tests failedNamed in output, or message
2079901622682521600
2026-07-22 12:09
373c9622bfd9
passed in another run (2 of this commit)
noneTestComputePodActionsWithContainerRestartRules/no_init_containers_have_been_started;_start_the_first_one, TestComputePodActionsWithContainerRestartRules/resize_of_a_running_non-sidecar_init_container, TestComputePodActionsWithContainerRestartRules
2079840204281090048
2026-07-22 08:05
5478128c02c1
no other run
noneTestComputePodActionsWithInitAndEphemeralContainers/no_init_containers_have_been_started;_start_the_first_one, TestComputePodActionsWithInitAndEphemeralContainers/resize_of_a_running_non-sidecar_init_container, TestComputePodActionsWithInitAndEphemeralContainers
2079825020552482816
2026-07-22 07:07
37e58561e3c9
no other run
noneTestComputePodActionsForRestartAllContainers/TestComputePodActionsWithInitContainers/no_init_containers_have_been_started;_start_the_first_one, TestComputePodActionsForRestartAllContainers/TestComputePodActionsWithInitContainers/resize_of_a_running_non-sidecar_init_container, TestComputePodActionsForRestartAllContainers/TestComputePodActionsWithInitContainers, TestComputePodActionsForRestartAllContainers
2079809739469885440
2026-07-22 06:04
39c618b5c30c
failed in every run (2 of this commit)
noneTestComputePodActionsWithContainerRestartRules/no_init_containers_have_been_started;_start_the_first_one, TestComputePodActionsWithContainerRestartRules/resize_of_a_running_non-sidecar_init_container, TestComputePodActionsWithContainerRestartRules
2079794179591901184
2026-07-22 05:03
39c618b5c30c
failed in every run (2 of this commit)
1TestComputePodActionsWithInitAndEphemeralContainers/no_init_containers_have_been_started;_start_the_first_one, TestComputePodActionsWithInitAndEphemeralContainers/resize_of_a_running_non-sidecar_init_container, TestComputePodActionsWithInitAndEphemeralContainers
2079717425376399360
2026-07-21 23:57
c59911870d64
passed in another run (2 of this commit)
noneTestComputePodActionsWithContainerRestartRules/resize_of_a_running_non-sidecar_init_container, TestComputePodActionsWithContainerRestartRules/no_init_containers_have_been_started;_start_the_first_one, TestComputePodActionsWithContainerRestartRules
2079686207066869760
2026-07-21 21:53
90904cf220ea
no other run
noneTestComputePodActionsWithInitContainers/resize_of_a_running_non-sidecar_init_container, TestComputePodActionsWithInitContainers/no_init_containers_have_been_started;_start_the_first_one, TestComputePodActionsWithInitContainers
2079670677815693312
2026-07-21 20:52
c6977342eb55
passed in another run (2 of this commit)
1TestComputePodActionsWithContainerRestartRules/resize_of_a_running_non-sidecar_init_container, TestComputePodActionsWithContainerRestartRules/no_init_containers_have_been_started;_start_the_first_one, TestComputePodActionsWithContainerRestartRules
[sig-api-machinery] k8s.io/apiserver/pkg/server.filters QUIET 2079963032879894528 · 2026-07-22 16:14 · fail · 9c722bc288a7 · TestPriorityAndFairnessWithPanicRecoveryAndTimeoutFilter/priority_level_concurrency_is_set_to_1,_request_times_out_and_inner_handler_hasn't_written_to_the_response_yet, TestPriorityAndFairnessWithPanicRecoveryAndTimeoutFilter2084823091803852800 · 2026-08-05 02:06 · fail · 25c88fd21984 · TestPriorityAndFairnessWithPanicRecoveryAndTimeoutFilter/priority_level_concurrency_is_set_to_1,_request_times_out_and_inner_handler_hasn't_written_to_the_response_yet, TestPriorityAndFairnessWithPanicRecoveryAndTimeoutFilter2087042740654182400 · 2026-08-11 05:09 · fail · 8c078bc32e90 · TestPriorityAndFairnessWithPanicRecoveryAndTimeoutFilter/priority_level_concurrency_is_set_to_1,_queue_length_is_1,_first_request_should_time_out_and_second_(enqueued)_request_should_time_out_as_well, TestPriorityAndFairnessWithPanicRecoveryAndTimeoutFilter2090836464140029952 · 2026-08-21 16:21 · fail · e81f39c0e03c · TestPriorityAndFairnessWithPanicRecoveryAndTimeoutFilter/priority_level_concurrency_is_set_to_1,_request_times_out_and_inner_handler_hasn't_written_to_the_response_yet, TestPriorityAndFairnessWithPanicRecoveryAndTimeoutFilter 4 0.19%

[sig-api-machinery] k8s.io/apiserver/pkg/server.filters

Final failure rate (95% CI)0.19% [0.072%–0.48%] · 4 of 2,153 runs
Usable outcomesruns: 2,153; skipped: 0; excluded: 0
Passed on retry0 (explicit failed attempts before a pass)
Retry exhaustion0 (every recorded attempt failed)
Flip rate0.37% of 2,152 usable consecutive pairs
Same-context rerun disagreement4/305 commit/branch/runner/OS groups; 0.42% of same-commit run pairs
Flakiness score0.004
Failures on a commit run again4 of 4 passed in another run of the same commit; 0 failed in every run of it
ActivityQuiet: 4 failures; the longest quiet spell between failures was 317 runs, and it has now been 1,128 runs (3.6 times as long). The burst is over; this does not say it cannot return, or why it stopped.
Duration trend (without retries)+0.2 ms/history run
Timing observations (without retries)2153
Duration × failure correlation-0.03
Failure messages
  • priority-and-fairness_test.go:836: Waiting for the controller to shutdown ×4

Tests named in this testcase's failures

The report keeps one record for the whole package; these names come from the failure output (--- FAIL: lines).

TestFailed runsPassed on same commitActivity
TestPriorityAndFairnessWithPanicRecoveryAndTimeoutFilter44 of 4quiet for 1,128 runs

Failures, newest first

RunSame commit, other runsOther tests failedNamed in output, or message
2090836464140029952
2026-08-21 16:21
e81f39c0e03c
passed in another run (115 of this commit)
noneTestPriorityAndFairnessWithPanicRecoveryAndTimeoutFilter/priority_level_concurrency_is_set_to_1,_request_times_out_and_inner_handler_hasn't_written_to_the_response_yet, TestPriorityAndFairnessWithPanicRecoveryAndTimeoutFilter
2087042740654182400
2026-08-11 05:09
8c078bc32e90
passed in another run (24 of this commit)
noneTestPriorityAndFairnessWithPanicRecoveryAndTimeoutFilter/priority_level_concurrency_is_set_to_1,_queue_length_is_1,_first_request_should_time_out_and_second_(enqueued)_request_should_time_out_as_well, TestPriorityAndFairnessWithPanicRecoveryAndTimeoutFilter
2084823091803852800
2026-08-05 02:06
25c88fd21984
passed in another run (11 of this commit)
noneTestPriorityAndFairnessWithPanicRecoveryAndTimeoutFilter/priority_level_concurrency_is_set_to_1,_request_times_out_and_inner_handler_hasn't_written_to_the_response_yet, TestPriorityAndFairnessWithPanicRecoveryAndTimeoutFilter
2079963032879894528
2026-07-22 16:14
9c722bc288a7
passed in another run (2 of this commit)
1TestPriorityAndFairnessWithPanicRecoveryAndTimeoutFilter/priority_level_concurrency_is_set_to_1,_request_times_out_and_inner_handler_hasn't_written_to_the_response_yet, TestPriorityAndFairnessWithPanicRecoveryAndTimeoutFilter
1,496 tests passed in every run that has an outcome for them — listed, not drawn
  • [sig-api-machinery] k8s.io.client-go 2,153 runs
  • [sig-api-machinery] k8s.io.sample-controller 2,153 runs
  • [sig-api-machinery] k8s.io/apiextensions-apiserver/examples/client-go/pkg/client/applyconfiguration/cr.v1 2,153 runs
  • [sig-api-machinery] k8s.io/apiextensions-apiserver/pkg.apihelpers 2,153 runs
  • [sig-api-machinery] k8s.io/apiextensions-apiserver/pkg.apis 2,153 runs
  • [sig-api-machinery] k8s.io/apiextensions-apiserver/pkg.apiserver 2,153 runs
  • [sig-api-machinery] k8s.io/apiextensions-apiserver/pkg/apis.apiextensions 2,153 runs
  • [sig-api-machinery] k8s.io/apiextensions-apiserver/pkg/apis/apiextensions.install 2,153 runs
  • [sig-api-machinery] k8s.io/apiextensions-apiserver/pkg/apis/apiextensions.v1 2,153 runs
  • [sig-api-machinery] k8s.io/apiextensions-apiserver/pkg/apis/apiextensions.v1beta1 2,153 runs
  • [sig-api-machinery] k8s.io/apiextensions-apiserver/pkg/apis/apiextensions.validation 2,153 runs
  • [sig-api-machinery] k8s.io/apiextensions-apiserver/pkg/apiserver.conversion 2,153 runs
  • [sig-api-machinery] k8s.io/apiextensions-apiserver/pkg/apiserver.schema 2,153 runs
  • [sig-api-machinery] k8s.io/apiextensions-apiserver/pkg/apiserver.validation 2,153 runs
  • [sig-api-machinery] k8s.io/apiextensions-apiserver/pkg/apiserver/schema.cel 2,153 runs
  • [sig-api-machinery] k8s.io/apiextensions-apiserver/pkg/apiserver/schema.defaulting 2,153 runs
  • [sig-api-machinery] k8s.io/apiextensions-apiserver/pkg/apiserver/schema.listtype 2,153 runs
  • [sig-api-machinery] k8s.io/apiextensions-apiserver/pkg/apiserver/schema.objectmeta 2,153 runs
  • [sig-api-machinery] k8s.io/apiextensions-apiserver/pkg/apiserver/schema.pruning 2,153 runs
  • [sig-api-machinery] k8s.io/apiextensions-apiserver/pkg/apiserver/schema/cel.model 2,153 runs
  • [sig-api-machinery] k8s.io/apiextensions-apiserver/pkg/client.clientset_test 2,153 runs
  • [sig-api-machinery] k8s.io/apiextensions-apiserver/pkg/controller.apiapproval 2,153 runs
  • [sig-api-machinery] k8s.io/apiextensions-apiserver/pkg/controller.nonstructuralschema 2,153 runs
  • [sig-api-machinery] k8s.io/apiextensions-apiserver/pkg/controller.openapi 2,153 runs
  • [sig-api-machinery] k8s.io/apiextensions-apiserver/pkg/controller.status 2,153 runs
  • [sig-api-machinery] k8s.io/apiextensions-apiserver/pkg/controller/openapi.builder 2,153 runs
  • [sig-api-machinery] k8s.io/apiextensions-apiserver/pkg/controller/openapi.v2 2,153 runs
  • [sig-api-machinery] k8s.io/apiextensions-apiserver/pkg/registry.customresource 2,153 runs
  • [sig-api-machinery] k8s.io/apiextensions-apiserver/pkg/registry.customresourcedefinition 2,153 runs
  • [sig-api-machinery] k8s.io/apiextensions-apiserver/pkg/registry/customresource.tableconvertor 2,153 runs
  • [sig-api-machinery] k8s.io/apiextensions-apiserver/pkg/registry/customresourcedefinition.tableconvertor 2,153 runs
  • [sig-api-machinery] k8s.io/apiextensions-apiserver/pkg/test.example 2,153 runs
  • [sig-api-machinery] k8s.io/apimachinery/pkg.conversion 2,153 runs
  • [sig-api-machinery] k8s.io/apimachinery/pkg.fields 2,153 runs
  • [sig-api-machinery] k8s.io/apimachinery/pkg.labels 2,153 runs
  • [sig-api-machinery] k8s.io/apimachinery/pkg.runtime 2,153 runs
  • [sig-api-machinery] k8s.io/apimachinery/pkg.sharding 2,153 runs
  • [sig-api-machinery] k8s.io/apimachinery/pkg.test 2,153 runs
  • [sig-api-machinery] k8s.io/apimachinery/pkg.types 383 runs
  • [sig-api-machinery] k8s.io/apimachinery/pkg.version 2,153 runs
  • [sig-api-machinery] k8s.io/apimachinery/pkg.watch 2,153 runs
  • [sig-api-machinery] k8s.io/apimachinery/pkg/api.errors 2,153 runs
  • [sig-api-machinery] k8s.io/apimachinery/pkg/api.meta 2,153 runs
  • [sig-api-machinery] k8s.io/apimachinery/pkg/api.operation 219 runs
  • [sig-api-machinery] k8s.io/apimachinery/pkg/api.resource 2,153 runs
  • [sig-api-machinery] k8s.io/apimachinery/pkg/api.validate 2,153 runs
  • [sig-api-machinery] k8s.io/apimachinery/pkg/api.validation 2,153 runs
  • [sig-api-machinery] k8s.io/apimachinery/pkg/api/apitesting.fuzzer 2,153 runs
  • [sig-api-machinery] k8s.io/apimachinery/pkg/api/validate.content 2,153 runs
  • [sig-api-machinery] k8s.io/apimachinery/pkg/apis/meta.internalversion 2,153 runs
  • [sig-api-machinery] k8s.io/apimachinery/pkg/apis/meta.v1 2,153 runs
  • [sig-api-machinery] k8s.io/apimachinery/pkg/apis/meta/internalversion.scheme 2,153 runs
  • [sig-api-machinery] k8s.io/apimachinery/pkg/apis/meta/internalversion.validation 2,153 runs
  • [sig-api-machinery] k8s.io/apimachinery/pkg/apis/meta/v1.unstructured 2,153 runs
  • [sig-api-machinery] k8s.io/apimachinery/pkg/apis/meta/v1.validation 2,153 runs
  • [sig-api-machinery] k8s.io/apimachinery/pkg/apis/testapigroup.install 2,153 runs
  • [sig-api-machinery] k8s.io/apimachinery/pkg/conversion.queryparams 2,153 runs
  • [sig-api-machinery] k8s.io/apimachinery/pkg/runtime.schema 2,153 runs
  • [sig-api-machinery] k8s.io/apimachinery/pkg/runtime.serializer 2,153 runs
  • [sig-api-machinery] k8s.io/apimachinery/pkg/runtime/serializer.cbor 2,153 runs
  • [sig-api-machinery] k8s.io/apimachinery/pkg/runtime/serializer.json 2,153 runs
  • [sig-api-machinery] k8s.io/apimachinery/pkg/runtime/serializer.protobuf 2,153 runs
  • [sig-api-machinery] k8s.io/apimachinery/pkg/runtime/serializer.streaming 2,153 runs
  • [sig-api-machinery] k8s.io/apimachinery/pkg/runtime/serializer.versioning 2,153 runs
  • [sig-api-machinery] k8s.io/apimachinery/pkg/runtime/serializer.yaml 2,153 runs
  • [sig-api-machinery] k8s.io/apimachinery/pkg/runtime/serializer/cbor/internal.modes 2,153 runs
  • [sig-api-machinery] k8s.io/apimachinery/pkg/runtime/serializer/recognizer.testing 2,153 runs
  • [sig-api-machinery] k8s.io/apimachinery/pkg/util.cache 2,153 runs
  • [sig-api-machinery] k8s.io/apimachinery/pkg/util.diff 2,153 runs
  • [sig-api-machinery] k8s.io/apimachinery/pkg/util.duration 2,153 runs
  • [sig-api-machinery] k8s.io/apimachinery/pkg/util.errors 2,153 runs
  • [sig-api-machinery] k8s.io/apimachinery/pkg/util.framer 2,153 runs
  • [sig-api-machinery] k8s.io/apimachinery/pkg/util.intstr 2,153 runs
  • [sig-api-machinery] k8s.io/apimachinery/pkg/util.json 2,153 runs
  • [sig-api-machinery] k8s.io/apimachinery/pkg/util.jsonmergepatch 2,153 runs
  • [sig-api-machinery] k8s.io/apimachinery/pkg/util.managedfields 2,153 runs
  • [sig-api-machinery] k8s.io/apimachinery/pkg/util.mergepatch 2,153 runs
  • [sig-api-machinery] k8s.io/apimachinery/pkg/util.naming 2,153 runs
  • [sig-api-machinery] k8s.io/apimachinery/pkg/util.proxy 2,153 runs
  • [sig-api-machinery] k8s.io/apimachinery/pkg/util.rand 2,153 runs
  • [sig-api-machinery] k8s.io/apimachinery/pkg/util.resourceversion 2,153 runs
  • [sig-api-machinery] k8s.io/apimachinery/pkg/util.runtime 2,153 runs
  • [sig-api-machinery] k8s.io/apimachinery/pkg/util.sets 2,153 runs
  • [sig-api-machinery] k8s.io/apimachinery/pkg/util.sort 2,153 runs
  • [sig-api-machinery] k8s.io/apimachinery/pkg/util.strategicpatch 2,153 runs
  • [sig-api-machinery] k8s.io/apimachinery/pkg/util.validation 2,153 runs
  • [sig-api-machinery] k8s.io/apimachinery/pkg/util.version 2,153 runs
  • [sig-api-machinery] k8s.io/apimachinery/pkg/util.wait 2,153 runs
  • [sig-api-machinery] k8s.io/apimachinery/pkg/util.waitgroup 2,153 runs
  • [sig-api-machinery] k8s.io/apimachinery/pkg/util.yaml 2,153 runs
  • [sig-api-machinery] k8s.io/apimachinery/pkg/util/managedfields.internal 2,153 runs
  • [sig-api-machinery] k8s.io/apimachinery/pkg/util/validation.field 2,153 runs
  • [sig-api-machinery] k8s.io/apimachinery/third_party/forked/golang.json 2,153 runs
  • [sig-api-machinery] k8s.io/apimachinery/third_party/forked/golang.reflect 2,153 runs
  • [sig-api-machinery] k8s.io/apiserver/pkg.admission 2,153 runs
  • [sig-api-machinery] k8s.io/apiserver/pkg.cel 2,153 runs
  • [sig-api-machinery] k8s.io/apiserver/pkg.endpoints 2,153 runs
  • [sig-api-machinery] k8s.io/apiserver/pkg.reconcilers 2,153 runs
  • [sig-api-machinery] k8s.io/apiserver/pkg.server 2,153 runs
  • [sig-api-machinery] k8s.io/apiserver/pkg.sharding 2,153 runs
  • [sig-api-machinery] k8s.io/apiserver/pkg.storage 2,153 runs
  • [sig-api-machinery] k8s.io/apiserver/pkg.storageversion 2,153 runs
  • [sig-api-machinery] k8s.io/apiserver/pkg.validation 2,153 runs
  • [sig-api-machinery] k8s.io/apiserver/pkg/admission.configuration 2,153 runs
  • [sig-api-machinery] k8s.io/apiserver/pkg/admission.initializer 2,153 runs
  • [sig-api-machinery] k8s.io/apiserver/pkg/admission.metrics 2,153 runs
  • [sig-api-machinery] k8s.io/apiserver/pkg/admission/plugin.authorizer 2,153 runs
  • [sig-api-machinery] k8s.io/apiserver/pkg/admission/plugin.cel 2,153 runs
  • [sig-api-machinery] k8s.io/apiserver/pkg/admission/plugin.manifest 2,153 runs
  • [sig-api-machinery] k8s.io/apiserver/pkg/admission/plugin.resourcequota 2,153 runs
  • [sig-api-machinery] k8s.io/apiserver/pkg/admission/plugin.webhook 2,153 runs
  • [sig-api-machinery] k8s.io/apiserver/pkg/admission/plugin/manifest.metrics 2,153 runs
  • [sig-api-machinery] k8s.io/apiserver/pkg/admission/plugin/namespace.lifecycle 2,153 runs
  • [sig-api-machinery] k8s.io/apiserver/pkg/admission/plugin/policy.config 2,153 runs
  • [sig-api-machinery] k8s.io/apiserver/pkg/admission/plugin/policy.generic 2,153 runs
  • [sig-api-machinery] k8s.io/apiserver/pkg/admission/plugin/policy.matching 2,153 runs
  • [sig-api-machinery] k8s.io/apiserver/pkg/admission/plugin/policy.mutating 2,153 runs
  • [sig-api-machinery] k8s.io/apiserver/pkg/admission/plugin/policy.validating 2,153 runs
  • [sig-api-machinery] k8s.io/apiserver/pkg/admission/plugin/policy/internal.generic 2,153 runs
  • [sig-api-machinery] k8s.io/apiserver/pkg/admission/plugin/policy/manifest.loader 2,153 runs
  • [sig-api-machinery] k8s.io/apiserver/pkg/admission/plugin/policy/manifest.source 2,153 runs
  • [sig-api-machinery] k8s.io/apiserver/pkg/admission/plugin/policy/mutating.metrics 2,153 runs
  • [sig-api-machinery] k8s.io/apiserver/pkg/admission/plugin/policy/mutating.patch 2,153 runs
  • [sig-api-machinery] k8s.io/apiserver/pkg/admission/plugin/policy/validating.metrics 2,153 runs
  • [sig-api-machinery] k8s.io/apiserver/pkg/admission/plugin/resourcequota/apis/resourcequota.validation 2,153 runs
  • [sig-api-machinery] k8s.io/apiserver/pkg/admission/plugin/webhook.config 2,153 runs
  • [sig-api-machinery] k8s.io/apiserver/pkg/admission/plugin/webhook.errors 2,153 runs
  • [sig-api-machinery] k8s.io/apiserver/pkg/admission/plugin/webhook.generic 2,153 runs
  • [sig-api-machinery] k8s.io/apiserver/pkg/admission/plugin/webhook.initializer 2,153 runs
  • [sig-api-machinery] k8s.io/apiserver/pkg/admission/plugin/webhook.matchconditions 2,153 runs
  • [sig-api-machinery] k8s.io/apiserver/pkg/admission/plugin/webhook.mutating 2,153 runs
  • [sig-api-machinery] k8s.io/apiserver/pkg/admission/plugin/webhook.request 2,153 runs
  • [sig-api-machinery] k8s.io/apiserver/pkg/admission/plugin/webhook.validating 2,153 runs
  • [sig-api-machinery] k8s.io/apiserver/pkg/admission/plugin/webhook/manifest.loader 2,153 runs
  • [sig-api-machinery] k8s.io/apiserver/pkg/admission/plugin/webhook/manifest.source 2,153 runs
  • [sig-api-machinery] k8s.io/apiserver/pkg/admission/plugin/webhook/predicates.namespace 2,153 runs
  • [sig-api-machinery] k8s.io/apiserver/pkg/admission/plugin/webhook/predicates.object 2,153 runs
  • [sig-api-machinery] k8s.io/apiserver/pkg/admission/plugin/webhook/predicates.rules 2,153 runs
  • [sig-api-machinery] k8s.io/apiserver/pkg/admission/testing.celtest 882 runs
  • [sig-api-machinery] k8s.io/apiserver/pkg/apis/apidiscovery.v2 1,615 runs
  • [sig-api-machinery] k8s.io/apiserver/pkg/apis/apiserver.load 2,153 runs
  • [sig-api-machinery] k8s.io/apiserver/pkg/apis/apiserver.v1 2,153 runs
  • [sig-api-machinery] k8s.io/apiserver/pkg/apis/apiserver.validation 2,153 runs
  • [sig-api-machinery] k8s.io/apiserver/pkg/apis/authorization.validation 703 runs
  • [sig-api-machinery] k8s.io/apiserver/pkg/apis/example.install 2,153 runs
  • [sig-api-machinery] k8s.io/apiserver/pkg/apis/example2.install 2,153 runs
  • [sig-api-machinery] k8s.io/apiserver/pkg/apis/flowcontrol.bootstrap 2,153 runs
  • [sig-api-machinery] k8s.io/apiserver/pkg/cel.common 2,153 runs
  • [sig-api-machinery] k8s.io/apiserver/pkg/cel.environment 2,153 runs
  • [sig-api-machinery] k8s.io/apiserver/pkg/cel.lazy 2,153 runs
  • [sig-api-machinery] k8s.io/apiserver/pkg/cel.library 2,153 runs
  • [sig-api-machinery] k8s.io/apiserver/pkg/cel.metrics 2,153 runs
  • [sig-api-machinery] k8s.io/apiserver/pkg/cel.mutation 2,153 runs
  • [sig-api-machinery] k8s.io/apiserver/pkg/cel.openapi 2,153 runs
  • [sig-api-machinery] k8s.io/apiserver/pkg/cel/mutation.dynamic 2,153 runs
  • [sig-api-machinery] k8s.io/apiserver/pkg/cel/openapi.resolver 2,153 runs
  • [sig-api-machinery] k8s.io/apiserver/pkg/endpoints.deprecation 2,153 runs
  • [sig-api-machinery] k8s.io/apiserver/pkg/endpoints.discovery 2,153 runs
  • [sig-api-machinery] k8s.io/apiserver/pkg/endpoints.filterlatency 2,153 runs
  • [sig-api-machinery] k8s.io/apiserver/pkg/endpoints.filters 2,153 runs
  • [sig-api-machinery] k8s.io/apiserver/pkg/endpoints.handlers 2,153 runs
  • [sig-api-machinery] k8s.io/apiserver/pkg/endpoints.metrics 2,153 runs
  • [sig-api-machinery] k8s.io/apiserver/pkg/endpoints.openapi 2,153 runs
  • [sig-api-machinery] k8s.io/apiserver/pkg/endpoints.request 2,153 runs
  • [sig-api-machinery] k8s.io/apiserver/pkg/endpoints.responsewriter 2,153 runs
  • [sig-api-machinery] k8s.io/apiserver/pkg/endpoints/discovery.aggregated 2,153 runs
  • [sig-api-machinery] k8s.io/apiserver/pkg/endpoints/handlers.fieldmanager 2,153 runs
  • [sig-api-machinery] k8s.io/apiserver/pkg/endpoints/handlers.finisher 2,153 runs
  • [sig-api-machinery] k8s.io/apiserver/pkg/endpoints/handlers.negotiation 2,153 runs
  • [sig-api-machinery] k8s.io/apiserver/pkg/endpoints/handlers.responsewriters 2,153 runs
  • [sig-api-machinery] k8s.io/apiserver/pkg/quota.v1 2,153 runs
  • [sig-api-machinery] k8s.io/apiserver/pkg/quota/v1.generic 2,153 runs
  • [sig-api-machinery] k8s.io/apiserver/pkg/registry.rest 2,153 runs
  • [sig-api-machinery] k8s.io/apiserver/pkg/registry/generic.registry 2,153 runs
  • [sig-api-machinery] k8s.io/apiserver/pkg/registry/generic.rest 2,153 runs
  • [sig-api-machinery] k8s.io/apiserver/pkg/server.dynamiccertificates 2,153 runs
  • [sig-api-machinery] k8s.io/apiserver/pkg/server.egressselector 2,153 runs
  • [sig-api-machinery] k8s.io/apiserver/pkg/server.healthz 2,153 runs
  • [sig-api-machinery] k8s.io/apiserver/pkg/server.httplog 2,153 runs
  • [sig-api-machinery] k8s.io/apiserver/pkg/server.mux 2,153 runs
  • [sig-api-machinery] k8s.io/apiserver/pkg/server.options 2,153 runs
  • [sig-api-machinery] k8s.io/apiserver/pkg/server.resourceconfig 2,153 runs
  • [sig-api-machinery] k8s.io/apiserver/pkg/server.routes 2,153 runs
  • [sig-api-machinery] k8s.io/apiserver/pkg/server.routine 2,153 runs
  • [sig-api-machinery] k8s.io/apiserver/pkg/server.storage 2,153 runs
  • [sig-api-machinery] k8s.io/apiserver/pkg/server/options/authenticationconfig.metrics 2,153 runs
  • [sig-api-machinery] k8s.io/apiserver/pkg/server/options/authorizationconfig.metrics 2,153 runs
  • [sig-api-machinery] k8s.io/apiserver/pkg/storage.feature 2,153 runs
  • [sig-api-machinery] k8s.io/apiserver/pkg/storage.names 2,153 runs
  • [sig-api-machinery] k8s.io/apiserver/pkg/storage.testing 2,153 runs
  • [sig-api-machinery] k8s.io/apiserver/pkg/storage/cacher.consistency 2,153 runs
  • [sig-api-machinery] k8s.io/apiserver/pkg/storage/cacher.key 2,153 runs
  • [sig-api-machinery] k8s.io/apiserver/pkg/storage/cacher.progress 2,153 runs
  • [sig-api-machinery] k8s.io/apiserver/pkg/storage/cacher.store 2,153 runs
  • [sig-api-machinery] k8s.io/apiserver/pkg/storage/testing.correctness 675 runs
  • [sig-api-machinery] k8s.io/apiserver/pkg/util.compatibility 2,153 runs
  • [sig-api-machinery] k8s.io/apiserver/pkg/util.configmetrics 2,153 runs
  • [sig-api-machinery] k8s.io/apiserver/pkg/util.filesystem 2,153 runs
  • [sig-api-machinery] k8s.io/apiserver/pkg/util.flowcontrol 2,153 runs
  • [sig-api-machinery] k8s.io/apiserver/pkg/util.flushwriter 2,153 runs
  • [sig-api-machinery] k8s.io/apiserver/pkg/util.notfoundhandler 2,153 runs
  • [sig-api-machinery] k8s.io/apiserver/pkg/util.openapi 2,153 runs
  • [sig-api-machinery] k8s.io/apiserver/pkg/util.peerproxy 2,153 runs
  • [sig-api-machinery] k8s.io/apiserver/pkg/util.responsewriter 2,153 runs
  • [sig-api-machinery] k8s.io/apiserver/pkg/util.shufflesharding 2,153 runs
  • [sig-api-machinery] k8s.io/apiserver/pkg/util.webhook 2,153 runs
  • [sig-api-machinery] k8s.io/apiserver/pkg/util.x509metrics 2,153 runs
  • [sig-api-machinery] k8s.io/apiserver/pkg/util/flowcontrol.fairqueuing 2,153 runs
  • [sig-api-machinery] k8s.io/apiserver/pkg/util/flowcontrol.format 201 runs
  • [sig-api-machinery] k8s.io/apiserver/pkg/util/flowcontrol.metrics 2,153 runs
  • [sig-api-machinery] k8s.io/apiserver/pkg/util/flowcontrol.request 2,153 runs
  • [sig-api-machinery] k8s.io/apiserver/pkg/util/flowcontrol/fairqueuing.eventclock 2,153 runs
  • [sig-api-machinery] k8s.io/apiserver/pkg/util/flowcontrol/fairqueuing.promise 2,153 runs
  • [sig-api-machinery] k8s.io/apiserver/pkg/util/flowcontrol/fairqueuing.queueset 2,153 runs
  • [sig-api-machinery] k8s.io/apiserver/pkg/util/flowcontrol/fairqueuing/testing.eventclock 2,153 runs
  • [sig-api-machinery] k8s.io/apiserver/pkg/util/flowcontrol/fairqueuing/testing.promise 2,153 runs
  • [sig-api-machinery] k8s.io/client-go.discovery 2,153 runs
  • [sig-api-machinery] k8s.io/client-go.dynamic 2,153 runs
  • [sig-api-machinery] k8s.io/client-go.features 2,153 runs
  • [sig-api-machinery] k8s.io/client-go.metadata 2,153 runs
  • [sig-api-machinery] k8s.io/client-go.openapi 2,153 runs
  • [sig-api-machinery] k8s.io/client-go.openapi3 2,153 runs
  • [sig-api-machinery] k8s.io/client-go.restmapper 2,153 runs
  • [sig-api-machinery] k8s.io/client-go.scale 2,153 runs
  • [sig-api-machinery] k8s.io/client-go.testing 2,153 runs
  • [sig-api-machinery] k8s.io/client-go/discovery.fake 2,153 runs
  • [sig-api-machinery] k8s.io/client-go/discovery/cached.disk 2,153 runs
  • [sig-api-machinery] k8s.io/client-go/discovery/cached.memory 2,153 runs
  • [sig-api-machinery] k8s.io/client-go/dynamic.dynamicinformer 2,153 runs
  • [sig-api-machinery] k8s.io/client-go/dynamic.dynamiclister 2,153 runs
  • [sig-api-machinery] k8s.io/client-go/dynamic.fake 2,153 runs
  • [sig-api-machinery] k8s.io/client-go/examples.fake-client 2,153 runs
  • [sig-api-machinery] k8s.io/client-go/features.testing 2,153 runs
  • [sig-api-machinery] k8s.io/client-go/kubernetes.fake 2,153 runs
  • [sig-api-machinery] k8s.io/client-go/kubernetes/typed/core.v1 2,153 runs
  • [sig-api-machinery] k8s.io/client-go/kubernetes/typed/core/v1.fake 2,153 runs
  • [sig-api-machinery] k8s.io/client-go/kubernetes/typed/events.v1beta1 2,153 runs
  • [sig-api-machinery] k8s.io/client-go/listers/extensions.v1beta1 2,153 runs
  • [sig-api-machinery] k8s.io/client-go/metadata.fake 2,153 runs
  • [sig-api-machinery] k8s.io/client-go/metadata.metadatainformer 2,153 runs
  • [sig-api-machinery] k8s.io/client-go/metadata.metadatalister 2,153 runs
  • [sig-api-machinery] k8s.io/client-go/openapi.openapitest 2,153 runs
  • [sig-api-machinery] k8s.io/client-go/rest.watch 2,153 runs
  • [sig-api-machinery] k8s.io/client-go/testing.internal 2,153 runs
  • [sig-api-machinery] k8s.io/client-go/tools.clientcmd 2,153 runs
  • [sig-api-machinery] k8s.io/client-go/tools.events 2,153 runs
  • [sig-api-machinery] k8s.io/client-go/tools.leaderelection 2,153 runs
  • [sig-api-machinery] k8s.io/client-go/tools.pager 2,153 runs
  • [sig-api-machinery] k8s.io/client-go/tools.portforward 2,153 runs
  • [sig-api-machinery] k8s.io/client-go/tools.record 2,153 runs
  • [sig-api-machinery] k8s.io/client-go/tools.reference 2,153 runs
  • [sig-api-machinery] k8s.io/client-go/tools/cache.synctrack 2,153 runs
  • [sig-api-machinery] k8s.io/client-go/tools/cache.testing 2,153 runs
  • [sig-api-machinery] k8s.io/client-go/tools/clientcmd.api 2,153 runs
  • [sig-api-machinery] k8s.io/client-go/tools/clientcmd/api.v1 2,153 runs
  • [sig-api-machinery] k8s.io/client-go/tools/leaderelection.resourcelock 2,153 runs
  • [sig-api-machinery] k8s.io/client-go/tools/record.util 2,153 runs
  • [sig-api-machinery] k8s.io/client-go/transport.websocket 2,153 runs
  • [sig-api-machinery] k8s.io/client-go/util.connrotation 2,153 runs
  • [sig-api-machinery] k8s.io/client-go/util.consistency 173 runs
  • [sig-api-machinery] k8s.io/client-go/util.consistencydetector 2,153 runs
  • [sig-api-machinery] k8s.io/client-go/util.csaupgrade 2,153 runs
  • [sig-api-machinery] k8s.io/client-go/util.flowcontrol 2,153 runs
  • [sig-api-machinery] k8s.io/client-go/util.jsonpath 2,153 runs
  • [sig-api-machinery] k8s.io/client-go/util.retry 2,153 runs
  • [sig-api-machinery] k8s.io/client-go/util.testing 2,153 runs
  • [sig-api-machinery] k8s.io/client-go/util.watchlist 2,153 runs
  • [sig-api-machinery] k8s.io/client-go/util.workqueue 2,153 runs
  • [sig-api-machinery] k8s.io/code-generator/cmd.validation-gen 1,364 runs
  • [sig-api-machinery] k8s.io/code-generator/cmd/applyconfiguration-gen.generators 24 runs
  • [sig-api-machinery] k8s.io/code-generator/cmd/client-gen.args 2,153 runs
  • [sig-api-machinery] k8s.io/code-generator/cmd/client-gen.types 2,153 runs
  • [sig-api-machinery] k8s.io/code-generator/cmd/client-gen/generators.util 2,153 runs
  • [sig-api-machinery] k8s.io/code-generator/cmd/conversion-gen.generators 2,153 runs
  • [sig-api-machinery] k8s.io/code-generator/cmd/deepcopy-gen.generators 2,153 runs
  • [sig-api-machinery] k8s.io/code-generator/cmd/deepcopy-gen.output_tests 2,153 runs
  • [sig-api-machinery] k8s.io/code-generator/cmd/deepcopy-gen/output_tests.wholepkg 2,153 runs
  • [sig-api-machinery] k8s.io/code-generator/cmd/defaulter-gen/output_tests.marker 2,153 runs
  • [sig-api-machinery] k8s.io/code-generator/cmd/go-to-protobuf.protobuf 2,153 runs
  • [sig-api-machinery] k8s.io/code-generator/cmd/prerelease-lifecycle-gen.prerelease-lifecycle-generators 2,153 runs
  • [sig-api-machinery] k8s.io/code-generator/cmd/register-gen.generators 2,153 runs
  • [sig-api-machinery] k8s.io/code-generator/cmd/validation-gen.args 789 runs
  • [sig-api-machinery] k8s.io/code-generator/cmd/validation-gen.generators 789 runs
  • [sig-api-machinery] k8s.io/code-generator/cmd/validation-gen.util 2,153 runs
  • [sig-api-machinery] k8s.io/code-generator/cmd/validation-gen.validators 2,153 runs
  • [sig-api-machinery] k8s.io/code-generator/cmd/validation-gen/examples/custom-prefix/output_tests.builtins 789 runs
  • [sig-api-machinery] k8s.io/code-generator/cmd/validation-gen/examples/custom-prefix/output_tests.startswith 789 runs
  • [sig-api-machinery] k8s.io/code-generator/cmd/validation-gen/examples/extensions/output_tests.formats 508 runs
  • [sig-api-machinery] k8s.io/code-generator/cmd/validation-gen/output_tests.cohorts 2,153 runs
  • [sig-api-machinery] k8s.io/code-generator/cmd/validation-gen/output_tests.cross_pkg 2,153 runs
  • [sig-api-machinery] k8s.io/code-generator/cmd/validation-gen/output_tests.elide_no_validations 2,153 runs
  • [sig-api-machinery] k8s.io/code-generator/cmd/validation-gen/output_tests.embedded 2,153 runs
  • [sig-api-machinery] k8s.io/code-generator/cmd/validation-gen/output_tests.multiple_tags 2,153 runs
  • [sig-api-machinery] k8s.io/code-generator/cmd/validation-gen/output_tests.no_types_match 2,153 runs
  • [sig-api-machinery] k8s.io/code-generator/cmd/validation-gen/output_tests.pointers 2,153 runs
  • [sig-api-machinery] k8s.io/code-generator/cmd/validation-gen/output_tests.primitives 2,153 runs
  • [sig-api-machinery] k8s.io/code-generator/cmd/validation-gen/output_tests.public_private 2,153 runs
  • [sig-api-machinery] k8s.io/code-generator/cmd/validation-gen/output_tests.type_args 2,153 runs
  • [sig-api-machinery] k8s.io/code-generator/cmd/validation-gen/output_tests.typedefs 2,153 runs
  • [sig-api-machinery] k8s.io/code-generator/cmd/validation-gen/output_tests.types_with_suffix 2,153 runs
  • [sig-api-machinery] k8s.io/code-generator/cmd/validation-gen/output_tests/all_types_match.trivial 2,153 runs
  • [sig-api-machinery] k8s.io/code-generator/cmd/validation-gen/output_tests/all_types_match.with_field_validations 2,153 runs
  • [sig-api-machinery] k8s.io/code-generator/cmd/validation-gen/output_tests/all_types_match.with_type_validations 2,153 runs
  • [sig-api-machinery] k8s.io/code-generator/cmd/validation-gen/output_tests/maps.keys 2,153 runs
  • [sig-api-machinery] k8s.io/code-generator/cmd/validation-gen/output_tests/maps.map_of_primitive 2,153 runs
  • [sig-api-machinery] k8s.io/code-generator/cmd/validation-gen/output_tests/maps.map_of_struct 2,153 runs
  • [sig-api-machinery] k8s.io/code-generator/cmd/validation-gen/output_tests/maps.multiple_validations 2,153 runs
  • [sig-api-machinery] k8s.io/code-generator/cmd/validation-gen/output_tests/maps.typedef_to_map 2,153 runs
  • [sig-api-machinery] k8s.io/code-generator/cmd/validation-gen/output_tests/multiple_packages.external 1,439 runs
  • [sig-api-machinery] k8s.io/code-generator/cmd/validation-gen/output_tests/multiple_packages.registered 2,131 runs
  • [sig-api-machinery] k8s.io/code-generator/cmd/validation-gen/output_tests/multiple_packages/othertree.external 692 runs
  • [sig-api-machinery] k8s.io/code-generator/cmd/validation-gen/output_tests/one_type_match.with_field_validations 2,153 runs
  • [sig-api-machinery] k8s.io/code-generator/cmd/validation-gen/output_tests/one_type_match.with_type_validations 2,153 runs
  • [sig-api-machinery] k8s.io/code-generator/cmd/validation-gen/output_tests/ordering.structs 2,153 runs
  • [sig-api-machinery] k8s.io/code-generator/cmd/validation-gen/output_tests/ordering.typedefs 2,153 runs
  • [sig-api-machinery] k8s.io/code-generator/cmd/validation-gen/output_tests/ratcheting.deep_equal_func 808 runs
  • [sig-api-machinery] k8s.io/code-generator/cmd/validation-gen/output_tests/ratcheting.deep_equal_func_cross_pkg 808 runs
  • [sig-api-machinery] k8s.io/code-generator/cmd/validation-gen/output_tests/ratcheting.default_behavior 2,153 runs
  • [sig-api-machinery] k8s.io/code-generator/cmd/validation-gen/output_tests/ratcheting.list 2,153 runs
  • [sig-api-machinery] k8s.io/code-generator/cmd/validation-gen/output_tests/ratcheting.subfield 2,153 runs
  • [sig-api-machinery] k8s.io/code-generator/cmd/validation-gen/output_tests/ratcheting/maps.eachkey 2,153 runs
  • [sig-api-machinery] k8s.io/code-generator/cmd/validation-gen/output_tests/ratcheting/maps.eachval 2,153 runs
  • [sig-api-machinery] k8s.io/code-generator/cmd/validation-gen/output_tests/recursive.maps 2,153 runs
  • [sig-api-machinery] k8s.io/code-generator/cmd/validation-gen/output_tests/recursive.pointers 2,153 runs
  • [sig-api-machinery] k8s.io/code-generator/cmd/validation-gen/output_tests/recursive.slices 2,153 runs
  • [sig-api-machinery] k8s.io/code-generator/cmd/validation-gen/output_tests/slices.multiple_validations 2,153 runs
  • [sig-api-machinery] k8s.io/code-generator/cmd/validation-gen/output_tests/slices.slice_of_primitive 2,153 runs
  • [sig-api-machinery] k8s.io/code-generator/cmd/validation-gen/output_tests/slices.slice_of_struct 2,153 runs
  • [sig-api-machinery] k8s.io/code-generator/cmd/validation-gen/output_tests/slices.typedef_to_slice 2,153 runs
  • [sig-api-machinery] k8s.io/code-generator/cmd/validation-gen/output_tests/tags.customvalidation 2,153 runs
  • [sig-api-machinery] k8s.io/code-generator/cmd/validation-gen/output_tests/tags.dependentforbidden 2,153 runs
  • [sig-api-machinery] k8s.io/code-generator/cmd/validation-gen/output_tests/tags.dependentrequired 2,153 runs
  • [sig-api-machinery] k8s.io/code-generator/cmd/validation-gen/output_tests/tags.eachkey 2,153 runs
  • [sig-api-machinery] k8s.io/code-generator/cmd/validation-gen/output_tests/tags.enum 2,153 runs
  • [sig-api-machinery] k8s.io/code-generator/cmd/validation-gen/output_tests/tags.forbidden 2,153 runs
  • [sig-api-machinery] k8s.io/code-generator/cmd/validation-gen/output_tests/tags.immutable 2,153 runs
  • [sig-api-machinery] k8s.io/code-generator/cmd/validation-gen/output_tests/tags.listset 2,153 runs
  • [sig-api-machinery] k8s.io/code-generator/cmd/validation-gen/output_tests/tags.maxbytes 2,153 runs
  • [sig-api-machinery] k8s.io/code-generator/cmd/validation-gen/output_tests/tags.maximum 2,153 runs
  • [sig-api-machinery] k8s.io/code-generator/cmd/validation-gen/output_tests/tags.maxlength 2,153 runs
  • [sig-api-machinery] k8s.io/code-generator/cmd/validation-gen/output_tests/tags.maxproperties 2,153 runs
  • [sig-api-machinery] k8s.io/code-generator/cmd/validation-gen/output_tests/tags.minimum 2,153 runs
  • [sig-api-machinery] k8s.io/code-generator/cmd/validation-gen/output_tests/tags.minlength 2,153 runs
  • [sig-api-machinery] k8s.io/code-generator/cmd/validation-gen/output_tests/tags.minproperties 2,153 runs
  • [sig-api-machinery] k8s.io/code-generator/cmd/validation-gen/output_tests/tags.mode 2,153 runs
  • [sig-api-machinery] k8s.io/code-generator/cmd/validation-gen/output_tests/tags.monotonic 2,149 runs
  • [sig-api-machinery] k8s.io/code-generator/cmd/validation-gen/output_tests/tags.opaque 2,153 runs
  • [sig-api-machinery] k8s.io/code-generator/cmd/validation-gen/output_tests/tags.optional 2,153 runs
  • [sig-api-machinery] k8s.io/code-generator/cmd/validation-gen/output_tests/tags.required 2,153 runs
  • [sig-api-machinery] k8s.io/code-generator/cmd/validation-gen/output_tests/tags.unique 2,153 runs
  • [sig-api-machinery] k8s.io/code-generator/cmd/validation-gen/output_tests/tags.validate_false 2,153 runs
  • [sig-api-machinery] k8s.io/code-generator/cmd/validation-gen/output_tests/tags.validate_true 2,153 runs
  • [sig-api-machinery] k8s.io/code-generator/cmd/validation-gen/output_tests/tags.validatetruealpha 2,153 runs
  • [sig-api-machinery] k8s.io/code-generator/cmd/validation-gen/output_tests/tags.validatetruebeta 2,153 runs
  • [sig-api-machinery] k8s.io/code-generator/cmd/validation-gen/output_tests/tags/eachval.map_of_pointers 981 runs
  • [sig-api-machinery] k8s.io/code-generator/cmd/validation-gen/output_tests/tags/eachval.map_of_primitive 2,153 runs
  • [sig-api-machinery] k8s.io/code-generator/cmd/validation-gen/output_tests/tags/eachval.map_of_struct 2,153 runs
  • [sig-api-machinery] k8s.io/code-generator/cmd/validation-gen/output_tests/tags/eachval.slice_of_pointers 2,153 runs
  • [sig-api-machinery] k8s.io/code-generator/cmd/validation-gen/output_tests/tags/eachval.slice_of_primitive 2,153 runs
  • [sig-api-machinery] k8s.io/code-generator/cmd/validation-gen/output_tests/tags/eachval.slice_of_struct 2,153 runs
  • [sig-api-machinery] k8s.io/code-generator/cmd/validation-gen/output_tests/tags/eachval.typedef_to_map 2,153 runs
  • [sig-api-machinery] k8s.io/code-generator/cmd/validation-gen/output_tests/tags/eachval.typedef_to_slice 2,153 runs
  • [sig-api-machinery] k8s.io/code-generator/cmd/validation-gen/output_tests/tags/enum.options 2,153 runs
  • [sig-api-machinery] k8s.io/code-generator/cmd/validation-gen/output_tests/tags/format.k8s-extended-resource-name 2,153 runs
  • [sig-api-machinery] k8s.io/code-generator/cmd/validation-gen/output_tests/tags/format.k8s-label-key 2,153 runs
  • [sig-api-machinery] k8s.io/code-generator/cmd/validation-gen/output_tests/tags/format.k8s-label-value 2,153 runs
  • [sig-api-machinery] k8s.io/code-generator/cmd/validation-gen/output_tests/tags/format.k8s-long-name-caseless 2,153 runs
  • [sig-api-machinery] k8s.io/code-generator/cmd/validation-gen/output_tests/tags/format.k8s-prefixed-label-key 1,877 runs
  • [sig-api-machinery] k8s.io/code-generator/cmd/validation-gen/output_tests/tags/format.k8s-resource-fully-qualified-name 2,153 runs
  • [sig-api-machinery] k8s.io/code-generator/cmd/validation-gen/output_tests/tags/format.k8s-resource-pool-name 2,153 runs
  • [sig-api-machinery] k8s.io/code-generator/cmd/validation-gen/output_tests/tags/format.k8s-uuid 2,153 runs
  • [sig-api-machinery] k8s.io/code-generator/cmd/validation-gen/output_tests/tags/format/k8s-long-name.k8s-long-name 2,153 runs
  • [sig-api-machinery] k8s.io/code-generator/cmd/validation-gen/output_tests/tags/format/k8s-short-name.k8s-short-name 2,153 runs
  • [sig-api-machinery] k8s.io/code-generator/cmd/validation-gen/output_tests/tags/item.immutable_transitions 2,153 runs
  • [sig-api-machinery] k8s.io/code-generator/cmd/validation-gen/output_tests/tags/item.multiple_keys 2,153 runs
  • [sig-api-machinery] k8s.io/code-generator/cmd/validation-gen/output_tests/tags/item.single_key 2,153 runs
  • [sig-api-machinery] k8s.io/code-generator/cmd/validation-gen/output_tests/tags/item.subfield 2,153 runs
  • [sig-api-machinery] k8s.io/code-generator/cmd/validation-gen/output_tests/tags/item.typedef 2,153 runs
  • [sig-api-machinery] k8s.io/code-generator/cmd/validation-gen/output_tests/tags/item/union.simple 2,153 runs
  • [sig-api-machinery] k8s.io/code-generator/cmd/validation-gen/output_tests/tags/item/union.typedef 2,153 runs
  • [sig-api-machinery] k8s.io/code-generator/cmd/validation-gen/output_tests/tags/item/zerorooneof.simple 2,153 runs
  • [sig-api-machinery] k8s.io/code-generator/cmd/validation-gen/output_tests/tags/item/zerorooneof.typedef 2,153 runs
  • [sig-api-machinery] k8s.io/code-generator/cmd/validation-gen/output_tests/tags/levels.atomicslice 2,153 runs
  • [sig-api-machinery] k8s.io/code-generator/cmd/validation-gen/output_tests/tags/levels.enums 2,153 runs
  • [sig-api-machinery] k8s.io/code-generator/cmd/validation-gen/output_tests/tags/levels.listkeys 2,153 runs
  • [sig-api-machinery] k8s.io/code-generator/cmd/validation-gen/output_tests/tags/levels.listmapitem 2,153 runs
  • [sig-api-machinery] k8s.io/code-generator/cmd/validation-gen/output_tests/tags/levels.listset 2,153 runs
  • [sig-api-machinery] k8s.io/code-generator/cmd/validation-gen/output_tests/tags/levels.mapvalidation 2,153 runs
  • [sig-api-machinery] k8s.io/code-generator/cmd/validation-gen/output_tests/tags/levels.modes 2,153 runs
  • [sig-api-machinery] k8s.io/code-generator/cmd/validation-gen/output_tests/tags/levels.optionalrequired 2,153 runs
  • [sig-api-machinery] k8s.io/code-generator/cmd/validation-gen/output_tests/tags/levels.simple 2,153 runs
  • [sig-api-machinery] k8s.io/code-generator/cmd/validation-gen/output_tests/tags/levels.structs 2,153 runs
  • [sig-api-machinery] k8s.io/code-generator/cmd/validation-gen/output_tests/tags/levels.subfields 2,153 runs
  • [sig-api-machinery] k8s.io/code-generator/cmd/validation-gen/output_tests/tags/levels.unions 2,153 runs
  • [sig-api-machinery] k8s.io/code-generator/cmd/validation-gen/output_tests/tags/levels.uniquetag 2,153 runs
  • [sig-api-machinery] k8s.io/code-generator/cmd/validation-gen/output_tests/tags/listmap.multiple_keys 2,153 runs
  • [sig-api-machinery] k8s.io/code-generator/cmd/validation-gen/output_tests/tags/listmap.single_key 2,153 runs
  • [sig-api-machinery] k8s.io/code-generator/cmd/validation-gen/output_tests/tags/maxitems.slice_of_primitive 2,153 runs
  • [sig-api-machinery] k8s.io/code-generator/cmd/validation-gen/output_tests/tags/maxitems.slice_of_struct 2,153 runs
  • [sig-api-machinery] k8s.io/code-generator/cmd/validation-gen/output_tests/tags/maxitems.typedef_to_slice 2,153 runs
  • [sig-api-machinery] k8s.io/code-generator/cmd/validation-gen/output_tests/tags/minitems.slice_of_primitive 2,153 runs
  • [sig-api-machinery] k8s.io/code-generator/cmd/validation-gen/output_tests/tags/minitems.slice_of_struct 2,153 runs
  • [sig-api-machinery] k8s.io/code-generator/cmd/validation-gen/output_tests/tags/minitems.typedef_to_slice 2,153 runs
  • [sig-api-machinery] k8s.io/code-generator/cmd/validation-gen/output_tests/tags/neq.neqbool 2,153 runs
  • [sig-api-machinery] k8s.io/code-generator/cmd/validation-gen/output_tests/tags/neq.neqint 2,153 runs
  • [sig-api-machinery] k8s.io/code-generator/cmd/validation-gen/output_tests/tags/neq.neqstring 2,153 runs
  • [sig-api-machinery] k8s.io/code-generator/cmd/validation-gen/output_tests/tags/neq/neq.neqchained 2,153 runs
  • [sig-api-machinery] k8s.io/code-generator/cmd/validation-gen/output_tests/tags/optional.nonzero_defaults 2,153 runs
  • [sig-api-machinery] k8s.io/code-generator/cmd/validation-gen/output_tests/tags/optional.zero_defaults 2,153 runs
  • [sig-api-machinery] k8s.io/code-generator/cmd/validation-gen/output_tests/tags/options.discriminators 2,153 runs
  • [sig-api-machinery] k8s.io/code-generator/cmd/validation-gen/output_tests/tags/options.lists 2,153 runs
  • [sig-api-machinery] k8s.io/code-generator/cmd/validation-gen/output_tests/tags/options.maps 2,153 runs
  • [sig-api-machinery] k8s.io/code-generator/cmd/validation-gen/output_tests/tags/options.simple 2,153 runs
  • [sig-api-machinery] k8s.io/code-generator/cmd/validation-gen/output_tests/tags/options.subfields 2,153 runs
  • [sig-api-machinery] k8s.io/code-generator/cmd/validation-gen/output_tests/tags/options.unions 2,153 runs
  • [sig-api-machinery] k8s.io/code-generator/cmd/validation-gen/output_tests/tags/options.update 2,153 runs
  • [sig-api-machinery] k8s.io/code-generator/cmd/validation-gen/output_tests/tags/subfield.deep 882 runs
  • [sig-api-machinery] k8s.io/code-generator/cmd/validation-gen/output_tests/tags/subfield.list 2,153 runs
  • [sig-api-machinery] k8s.io/code-generator/cmd/validation-gen/output_tests/tags/subfield.nonincluded 2,153 runs
  • [sig-api-machinery] k8s.io/code-generator/cmd/validation-gen/output_tests/tags/subfield.shallow 2,153 runs
  • [sig-api-machinery] k8s.io/code-generator/cmd/validation-gen/output_tests/tags/subfield.shortcircuit 1,549 runs
  • [sig-api-machinery] k8s.io/code-generator/cmd/validation-gen/output_tests/tags/subfield.unions 2,153 runs
  • [sig-api-machinery] k8s.io/code-generator/cmd/validation-gen/output_tests/tags/supported_resources.issubresource 2,153 runs
  • [sig-api-machinery] k8s.io/code-generator/cmd/validation-gen/output_tests/tags/supported_resources.root 2,153 runs
  • [sig-api-machinery] k8s.io/code-generator/cmd/validation-gen/output_tests/tags/supported_resources.subresource 2,153 runs
  • [sig-api-machinery] k8s.io/code-generator/cmd/validation-gen/output_tests/tags/union/union/discriminated.custom_members 2,153 runs
  • [sig-api-machinery] k8s.io/code-generator/cmd/validation-gen/output_tests/tags/union/union/discriminated.empty 2,153 runs
  • [sig-api-machinery] k8s.io/code-generator/cmd/validation-gen/output_tests/tags/union/union/discriminated.multiple 2,153 runs
  • [sig-api-machinery] k8s.io/code-generator/cmd/validation-gen/output_tests/tags/union/union/discriminated.simple 2,153 runs
  • [sig-api-machinery] k8s.io/code-generator/cmd/validation-gen/output_tests/tags/union/union/discriminated.sparse 2,153 runs
  • [sig-api-machinery] k8s.io/code-generator/cmd/validation-gen/output_tests/tags/union/union/undiscriminated.custom_members 2,153 runs
  • [sig-api-machinery] k8s.io/code-generator/cmd/validation-gen/output_tests/tags/union/union/undiscriminated.multiple 2,153 runs
  • [sig-api-machinery] k8s.io/code-generator/cmd/validation-gen/output_tests/tags/union/union/undiscriminated.simple 2,153 runs
  • [sig-api-machinery] k8s.io/code-generator/cmd/validation-gen/output_tests/tags/update.lists 2,153 runs
  • [sig-api-machinery] k8s.io/code-generator/cmd/validation-gen/output_tests/tags/update.maps 2,153 runs
  • [sig-api-machinery] k8s.io/code-generator/cmd/validation-gen/output_tests/tags/update.primitives 2,153 runs
  • [sig-api-machinery] k8s.io/code-generator/cmd/validation-gen/output_tests/tags/zerooroneof/zerooroneof.custom_members 2,153 runs
  • [sig-api-machinery] k8s.io/code-generator/cmd/validation-gen/output_tests/tags/zerooroneof/zerooroneof.multiple 2,153 runs
  • [sig-api-machinery] k8s.io/code-generator/cmd/validation-gen/output_tests/tags/zerooroneof/zerooroneof.simple 2,153 runs
  • [sig-api-machinery] k8s.io/code-generator/cmd/validation-gen/output_tests/update_validations.lists 2,153 runs
  • [sig-api-machinery] k8s.io/code-generator/cmd/validation-gen/output_tests/update_validations.maps 2,153 runs
  • [sig-api-machinery] k8s.io/code-generator/cmd/validation-gen/output_tests/update_validations.primitive_pointers 2,153 runs
  • [sig-api-machinery] k8s.io/code-generator/cmd/validation-gen/output_tests/update_validations.primitives 2,153 runs
  • [sig-api-machinery] k8s.io/code-generator/pkg.apidefinitions 2,153 runs
  • [sig-api-machinery] k8s.io/code-generator/pkg.util 2,153 runs
  • [sig-api-machinery] k8s.io/component-base.compatibility 2,153 runs
  • [sig-api-machinery] k8s.io/component-base.featuregate 2,153 runs
  • [sig-api-machinery] k8s.io/component-base/config.testing 2,153 runs
  • [sig-api-machinery] k8s.io/component-base/config.validation 2,153 runs
  • [sig-api-machinery] k8s.io/component-base/featuregate.testing 2,153 runs
  • [sig-api-machinery] k8s.io/component-base/version.verflag 2,153 runs
  • [sig-api-machinery] k8s.io/component-helpers/apimachinery.lease 2,153 runs
  • [sig-api-machinery] k8s.io/controller-manager.app 2,153 runs
  • [sig-api-machinery] k8s.io/controller-manager.options 2,153 runs
  • [sig-api-machinery] k8s.io/controller-manager/pkg.features 217 runs
  • [sig-api-machinery] k8s.io/controller-manager/pkg.healthz 2,153 runs
  • [sig-api-machinery] k8s.io/controller-manager/pkg.leadermigration 2,153 runs
  • [sig-api-machinery] k8s.io/controller-manager/pkg/leadermigration.config 2,153 runs
  • [sig-api-machinery] k8s.io/controller-manager/pkg/leadermigration.options 2,153 runs
  • [sig-api-machinery] k8s.io/kube-aggregator/pkg.apis 2,153 runs
  • [sig-api-machinery] k8s.io/kube-aggregator/pkg.apiserver 2,153 runs
  • [sig-api-machinery] k8s.io/kube-aggregator/pkg/apis.apiregistration 2,153 runs
  • [sig-api-machinery] k8s.io/kube-aggregator/pkg/apis/apiregistration/v1.helper 2,153 runs
  • [sig-api-machinery] k8s.io/kube-aggregator/pkg/controllers.autoregister 2,153 runs
  • [sig-api-machinery] k8s.io/kube-aggregator/pkg/controllers/openapi.aggregator 2,153 runs
  • [sig-api-machinery] k8s.io/kube-aggregator/pkg/controllers/openapiv3.aggregator 2,153 runs
  • [sig-api-machinery] k8s.io/kube-aggregator/pkg/controllers/status.local 2,153 runs
  • [sig-api-machinery] k8s.io/kube-aggregator/pkg/controllers/status.metrics 2,153 runs
  • [sig-api-machinery] k8s.io/kube-aggregator/pkg/controllers/status.remote 2,153 runs
  • [sig-api-machinery] k8s.io/kubernetes/cmd/kube-apiserver/app.options 2,153 runs
  • [sig-api-machinery] k8s.io/kubernetes/cmd/kube-apiserver/app.testing 730 runs
  • [sig-api-machinery] k8s.io/kubernetes/cmd/kube-controller-manager.app 2,153 runs
  • [sig-api-machinery] k8s.io/kubernetes/cmd/kube-controller-manager/app.options 2,153 runs
  • [sig-api-machinery] k8s.io/kubernetes/pkg.controlplane 2,153 runs
  • [sig-api-machinery] k8s.io/kubernetes/pkg/controller.garbagecollector 2,153 runs
  • [sig-api-machinery] k8s.io/kubernetes/pkg/controller.storageversiongc 2,153 runs
  • [sig-api-machinery] k8s.io/kubernetes/pkg/controller.storageversionmigrator 2,153 runs
  • [sig-api-machinery] k8s.io/kubernetes/pkg/controller.validatingadmissionpolicystatus 2,153 runs
  • [sig-api-machinery] k8s.io/kubernetes/pkg/controller/namespace.deletion 2,153 runs
  • [sig-api-machinery] k8s.io/kubernetes/pkg/controller/validatingadmissionpolicystatus/config.v1alpha1 2,153 runs
  • [sig-api-machinery] k8s.io/kubernetes/pkg/controlplane.apiserver 2,153 runs
  • [sig-api-machinery] k8s.io/kubernetes/pkg/controlplane.reconcilers 2,153 runs
  • [sig-api-machinery] k8s.io/kubernetes/pkg/controlplane/apiserver.admission 2,153 runs
  • [sig-api-machinery] k8s.io/kubernetes/pkg/controlplane/apiserver.options 2,153 runs
  • [sig-api-machinery] k8s.io/kubernetes/pkg/controlplane/apiserver/samples/generic.server 2,153 runs
  • [sig-api-machinery] k8s.io/kubernetes/pkg/controlplane/controller.apiserverleasegc 2,153 runs
  • [sig-api-machinery] k8s.io/kubernetes/pkg/controlplane/controller.clusterauthenticationtrust 2,153 runs
  • [sig-api-machinery] k8s.io/kubernetes/pkg/controlplane/controller.crdregistration 2,153 runs
  • [sig-api-machinery] k8s.io/kubernetes/pkg/controlplane/controller.kubernetesservice 2,153 runs
  • [sig-api-machinery] k8s.io/kubernetes/pkg/controlplane/controller.leaderelection 2,153 runs
  • [sig-api-machinery] k8s.io/kubernetes/pkg/controlplane/controller.legacytokentracking 2,153 runs
  • [sig-api-machinery] k8s.io/kubernetes/pkg/controlplane/controller.systemnamespaces 2,153 runs
  • [sig-api-machinery] k8s.io/kubernetes/pkg/kubeapiserver.options 2,153 runs
  • [sig-api-machinery] k8s.io/kubernetes/pkg/quota/v1.install 2,153 runs
  • [sig-api-machinery] k8s.io/kubernetes/pkg/quota/v1/evaluator.core 2,153 runs
  • [sig-api-machinery] k8s.io/kubernetes/test/compatibility_lifecycle.cmd 2,153 runs
  • [sig-api-machinery] k8s.io/sample-apiserver/pkg.apiserver 2,153 runs
  • [sig-api-machinery] k8s.io/sample-apiserver/pkg/admission.wardleinitializer 2,153 runs
  • [sig-api-machinery] k8s.io/sample-apiserver/pkg/admission/plugin.banflunder 2,153 runs
  • [sig-api-machinery] k8s.io/sample-apiserver/pkg/apis/wardle.install 2,153 runs
  • [sig-api-machinery] k8s.io/sample-apiserver/pkg/cmd.server 2,153 runs
  • [sig-api-machinery] k8s.io/streaming/pkg.httpstream 2,153 runs
  • [sig-api-machinery] k8s.io/streaming/pkg/httpstream.spdy 2,153 runs
  • [sig-api-machinery] k8s.io/streaming/pkg/httpstream.wsstream 2,153 runs
  • [sig-apps] k8s.io/kubernetes/pkg.controller 2,153 runs
  • [sig-apps] k8s.io/kubernetes/pkg/apis.core 2,153 runs
  • [sig-apps] k8s.io/kubernetes/pkg/apis/apps.v1 2,153 runs
  • [sig-apps] k8s.io/kubernetes/pkg/apis/apps.v1beta1 2,153 runs
  • [sig-apps] k8s.io/kubernetes/pkg/apis/apps.v1beta2 2,153 runs
  • [sig-apps] k8s.io/kubernetes/pkg/apis/apps.validation 2,153 runs
  • [sig-apps] k8s.io/kubernetes/pkg/apis/batch.v1 2,153 runs
  • [sig-apps] k8s.io/kubernetes/pkg/apis/batch.v1beta1 2,153 runs
  • [sig-apps] k8s.io/kubernetes/pkg/apis/batch.validation 2,153 runs
  • [sig-apps] k8s.io/kubernetes/pkg/apis/core.helper 2,153 runs
  • [sig-apps] k8s.io/kubernetes/pkg/apis/core.install 2,153 runs
  • [sig-apps] k8s.io/kubernetes/pkg/apis/core.pods 2,153 runs
  • [sig-apps] k8s.io/kubernetes/pkg/apis/core.v1 2,153 runs
  • [sig-apps] k8s.io/kubernetes/pkg/apis/core.validation 2,153 runs
  • [sig-apps] k8s.io/kubernetes/pkg/apis/core/v1.helper 2,153 runs
  • [sig-apps] k8s.io/kubernetes/pkg/apis/core/v1.validation 2,153 runs
  • [sig-apps] k8s.io/kubernetes/pkg/apis/core/v1/helper.qos 2,153 runs
  • [sig-apps] k8s.io/kubernetes/pkg/apis/extensions.v1beta1 2,153 runs
  • [sig-apps] k8s.io/kubernetes/pkg/controller.bootstrap 2,153 runs
  • [sig-apps] k8s.io/kubernetes/pkg/controller.clusterroleaggregation 2,153 runs
  • [sig-apps] k8s.io/kubernetes/pkg/controller.cronjob 2,153 runs
  • [sig-apps] k8s.io/kubernetes/pkg/controller.daemon 2,153 runs
  • [sig-apps] k8s.io/kubernetes/pkg/controller.deployment 2,153 runs
  • [sig-apps] k8s.io/kubernetes/pkg/controller.disruption 2,153 runs
  • [sig-apps] k8s.io/kubernetes/pkg/controller.history 2,153 runs
  • [sig-apps] k8s.io/kubernetes/pkg/controller.job 2,153 runs
  • [sig-apps] k8s.io/kubernetes/pkg/controller.podgc 2,153 runs
  • [sig-apps] k8s.io/kubernetes/pkg/controller.replication 2,153 runs
  • [sig-apps] k8s.io/kubernetes/pkg/controller.resourcepoolstatusrequest 2,153 runs
  • [sig-apps] k8s.io/kubernetes/pkg/controller.resourcequota 2,153 runs
  • [sig-apps] k8s.io/kubernetes/pkg/controller.statefulset 2,153 runs
  • [sig-apps] k8s.io/kubernetes/pkg/controller.ttl 2,153 runs
  • [sig-apps] k8s.io/kubernetes/pkg/controller.ttlafterfinished 2,153 runs
  • [sig-apps] k8s.io/kubernetes/pkg/controller/apis/config.scheme 2,153 runs
  • [sig-apps] k8s.io/kubernetes/pkg/controller/apis/config.v1alpha1 2,153 runs
  • [sig-apps] k8s.io/kubernetes/pkg/controller/daemon.util 2,153 runs
  • [sig-apps] k8s.io/kubernetes/pkg/controller/deployment.util 2,153 runs
  • [sig-apps] k8s.io/kubernetes/pkg/controller/job.util 2,153 runs
  • [sig-apps] k8s.io/kubernetes/pkg/controller/resourcepoolstatusrequest.metrics 2,153 runs
  • [sig-apps] k8s.io/kubernetes/pkg/controller/scheduling.podgroupprotection 2,153 runs
  • [sig-apps] k8s.io/kubernetes/pkg/controller/util.consistency 1,980 runs
  • [sig-apps] k8s.io/kubernetes/pkg/controller/util.protectionutil 2,153 runs
  • [sig-apps] k8s.io/kubernetes/pkg/controller/util.selectors 2,153 runs
  • [sig-apps] k8s.io/kubernetes/pkg/registry/apps.controllerrevision 2,153 runs
  • [sig-apps] k8s.io/kubernetes/pkg/registry/apps.daemonset 2,153 runs
  • [sig-apps] k8s.io/kubernetes/pkg/registry/apps.deployment 2,153 runs
  • [sig-apps] k8s.io/kubernetes/pkg/registry/apps.replicaset 2,153 runs
  • [sig-apps] k8s.io/kubernetes/pkg/registry/apps.statefulset 2,153 runs
  • [sig-apps] k8s.io/kubernetes/pkg/registry/apps/controllerrevision.storage 2,153 runs
  • [sig-apps] k8s.io/kubernetes/pkg/registry/apps/daemonset.storage 2,153 runs
  • [sig-apps] k8s.io/kubernetes/pkg/registry/apps/deployment.storage 2,153 runs
  • [sig-apps] k8s.io/kubernetes/pkg/registry/apps/replicaset.storage 2,153 runs
  • [sig-apps] k8s.io/kubernetes/pkg/registry/apps/statefulset.storage 2,153 runs
  • [sig-apps] k8s.io/kubernetes/pkg/registry/batch.cronjob 2,153 runs
  • [sig-apps] k8s.io/kubernetes/pkg/registry/batch.job 2,153 runs
  • [sig-apps] k8s.io/kubernetes/pkg/registry/batch/cronjob.storage 2,153 runs
  • [sig-apps] k8s.io/kubernetes/pkg/registry/batch/job.storage 2,153 runs
  • [sig-apps] k8s.io/kubernetes/pkg/registry/core.replicationcontroller 2,153 runs
  • [sig-apps] k8s.io/kubernetes/pkg/registry/core/replicationcontroller.storage 2,153 runs
  • [sig-apps] k8s.io/kubernetes/pkg/registry/policy.poddisruptionbudget 2,153 runs
  • [sig-apps] k8s.io/kubernetes/pkg/registry/policy/poddisruptionbudget.storage 2,153 runs
  • [sig-architecture] k8s.io/kubernetes/test.conformance 2,153 runs
  • [sig-auth] k8s.io/apiserver/pkg.audit 2,153 runs
  • [sig-auth] k8s.io/apiserver/pkg/apis/audit.install 2,153 runs
  • [sig-auth] k8s.io/apiserver/pkg/apis/audit.validation 2,153 runs
  • [sig-auth] k8s.io/apiserver/pkg/audit.policy 2,153 runs
  • [sig-auth] k8s.io/apiserver/pkg/authentication.authenticator 2,153 runs
  • [sig-auth] k8s.io/apiserver/pkg/authentication.cel 2,153 runs
  • [sig-auth] k8s.io/apiserver/pkg/authentication.group 2,153 runs
  • [sig-auth] k8s.io/apiserver/pkg/authentication.serviceaccount 2,153 runs
  • [sig-auth] k8s.io/apiserver/pkg/authentication/request.anonymous 2,153 runs
  • [sig-auth] k8s.io/apiserver/pkg/authentication/request.bearertoken 2,153 runs
  • [sig-auth] k8s.io/apiserver/pkg/authentication/request.headerrequest 2,153 runs
  • [sig-auth] k8s.io/apiserver/pkg/authentication/request.union 2,153 runs
  • [sig-auth] k8s.io/apiserver/pkg/authentication/request.websocket 2,153 runs
  • [sig-auth] k8s.io/apiserver/pkg/authentication/request.x509 2,153 runs
  • [sig-auth] k8s.io/apiserver/pkg/authentication/token.cache 2,153 runs
  • [sig-auth] k8s.io/apiserver/pkg/authentication/token.tokenfile 2,153 runs
  • [sig-auth] k8s.io/apiserver/pkg/authentication/token.union 2,153 runs
  • [sig-auth] k8s.io/apiserver/pkg/authorization.authorizer 2,153 runs
  • [sig-auth] k8s.io/apiserver/pkg/authorization.authorizerfactory 2,153 runs
  • [sig-auth] k8s.io/apiserver/pkg/authorization.cel 2,153 runs
  • [sig-auth] k8s.io/apiserver/pkg/authorization.metrics 2,153 runs
  • [sig-auth] k8s.io/apiserver/pkg/authorization.path 2,153 runs
  • [sig-auth] k8s.io/apiserver/pkg/authorization.union 2,153 runs
  • [sig-auth] k8s.io/apiserver/pkg/endpoints/filters.impersonation 2,153 runs
  • [sig-auth] k8s.io/apiserver/pkg/endpoints/filters/impersonation.metrics 2,153 runs
  • [sig-auth] k8s.io/apiserver/pkg/server/options.encryptionconfig 2,153 runs
  • [sig-auth] k8s.io/apiserver/pkg/server/options/encryptionconfig.controller 2,153 runs
  • [sig-auth] k8s.io/apiserver/pkg/server/options/encryptionconfig.metrics 2,153 runs
  • [sig-auth] k8s.io/apiserver/pkg/storage.value 2,153 runs
  • [sig-auth] k8s.io/apiserver/pkg/storage/value/encrypt.aes 2,153 runs
  • [sig-auth] k8s.io/apiserver/pkg/storage/value/encrypt.envelope 2,153 runs
  • [sig-auth] k8s.io/apiserver/pkg/storage/value/encrypt.secretbox 2,153 runs
  • [sig-auth] k8s.io/apiserver/pkg/storage/value/encrypt/envelope.kmsv2 2,153 runs
  • [sig-auth] k8s.io/apiserver/pkg/storage/value/encrypt/envelope.metrics 2,153 runs
  • [sig-auth] k8s.io/apiserver/plugin/pkg/audit.buffered 2,153 runs
  • [sig-auth] k8s.io/apiserver/plugin/pkg/audit.log 2,153 runs
  • [sig-auth] k8s.io/apiserver/plugin/pkg/audit.truncate 2,153 runs
  • [sig-auth] k8s.io/apiserver/plugin/pkg/audit.webhook 2,153 runs
  • [sig-auth] k8s.io/apiserver/plugin/pkg/authenticator/token.oidc 2,153 runs
  • [sig-auth] k8s.io/apiserver/plugin/pkg/authenticator/token.webhook 2,153 runs
  • [sig-auth] k8s.io/apiserver/plugin/pkg/authorizer.webhook 2,153 runs
  • [sig-auth] k8s.io/apiserver/plugin/pkg/authorizer/webhook.metrics 2,153 runs
  • [sig-auth] k8s.io/client-go/plugin/pkg/client/auth.exec 2,153 runs
  • [sig-auth] k8s.io/client-go/plugin/pkg/client/auth.oidc 2,153 runs
  • [sig-auth] k8s.io/client-go/tools.auth 2,153 runs
  • [sig-auth] k8s.io/client-go/tools/auth.exec 2,153 runs
  • [sig-auth] k8s.io/client-go/util.cert 2,153 runs
  • [sig-auth] k8s.io/client-go/util.certificate 2,153 runs
  • [sig-auth] k8s.io/client-go/util.keyutil 2,153 runs
  • [sig-auth] k8s.io/client-go/util/certificate.csr 2,153 runs
  • [sig-auth] k8s.io/component-helpers/auth/rbac.reconciliation 2,153 runs
  • [sig-auth] k8s.io/component-helpers/auth/rbac.validation 2,153 runs
  • [sig-auth] k8s.io/kms/pkg.service 2,153 runs
  • [sig-auth] k8s.io/kms/pkg.util 2,153 runs
  • [sig-auth] k8s.io/kubectl/pkg/cmd.auth 2,153 runs
  • [sig-auth] k8s.io/kubernetes/pkg.credentialprovider 2,153 runs
  • [sig-auth] k8s.io/kubernetes/pkg.serviceaccount 2,153 runs
  • [sig-auth] k8s.io/kubernetes/pkg/apis.rbac 2,153 runs
  • [sig-auth] k8s.io/kubernetes/pkg/apis/abac.v0 2,153 runs
  • [sig-auth] k8s.io/kubernetes/pkg/apis/abac.v1beta1 2,153 runs
  • [sig-auth] k8s.io/kubernetes/pkg/apis/authentication.validation 1,819 runs
  • [sig-auth] k8s.io/kubernetes/pkg/apis/authorization.validation 1,450 runs
  • [sig-auth] k8s.io/kubernetes/pkg/apis/certificates.v1beta1 2,153 runs
  • [sig-auth] k8s.io/kubernetes/pkg/apis/certificates.validation 2,153 runs
  • [sig-auth] k8s.io/kubernetes/pkg/apis/policy.v1 2,101 runs
  • [sig-auth] k8s.io/kubernetes/pkg/apis/policy.v1beta1 2,153 runs
  • [sig-auth] k8s.io/kubernetes/pkg/apis/policy.validation 2,153 runs
  • [sig-auth] k8s.io/kubernetes/pkg/apis/rbac.v1alpha1 2,153 runs
  • [sig-auth] k8s.io/kubernetes/pkg/apis/rbac.validation 2,153 runs
  • [sig-auth] k8s.io/kubernetes/pkg/auth.nodeidentifier 2,153 runs
  • [sig-auth] k8s.io/kubernetes/pkg/auth/authorizer.abac 2,153 runs
  • [sig-auth] k8s.io/kubernetes/pkg/controller.certificates 2,153 runs
  • [sig-auth] k8s.io/kubernetes/pkg/controller.serviceaccount 2,153 runs
  • [sig-auth] k8s.io/kubernetes/pkg/controller/certificates.approver 2,153 runs
  • [sig-auth] k8s.io/kubernetes/pkg/controller/certificates.authority 2,153 runs
  • [sig-auth] k8s.io/kubernetes/pkg/controller/certificates.cleaner 2,153 runs
  • [sig-auth] k8s.io/kubernetes/pkg/controller/certificates.clustertrustbundlepublisher 2,153 runs
  • [sig-auth] k8s.io/kubernetes/pkg/controller/certificates.rootcacertpublisher 2,153 runs
  • [sig-auth] k8s.io/kubernetes/pkg/controller/certificates.signer 2,153 runs
  • [sig-auth] k8s.io/kubernetes/pkg/credentialprovider.plugin 2,153 runs
  • [sig-auth] k8s.io/kubernetes/pkg/credentialprovider.secrets 2,153 runs
  • [sig-auth] k8s.io/kubernetes/pkg/kubeapiserver/authorizer.modes 2,153 runs
  • [sig-auth] k8s.io/kubernetes/pkg/kubelet.certificate 2,153 runs
  • [sig-auth] k8s.io/kubernetes/pkg/kubelet.token 2,153 runs
  • [sig-auth] k8s.io/kubernetes/pkg/kubelet/certificate.bootstrap 2,153 runs
  • [sig-auth] k8s.io/kubernetes/pkg/kubelet/certificate.keyalgorithm 367 runs
  • [sig-auth] k8s.io/kubernetes/pkg/registry.rbac 2,153 runs
  • [sig-auth] k8s.io/kubernetes/pkg/registry/authorization.subjectaccessreview 2,153 runs
  • [sig-auth] k8s.io/kubernetes/pkg/registry/authorization.util 2,153 runs
  • [sig-auth] k8s.io/kubernetes/pkg/registry/certificates.certificates 2,153 runs
  • [sig-auth] k8s.io/kubernetes/pkg/registry/certificates.clustertrustbundle 2,153 runs
  • [sig-auth] k8s.io/kubernetes/pkg/registry/certificates.podcertificaterequest 2,153 runs
  • [sig-auth] k8s.io/kubernetes/pkg/registry/certificates/certificates.storage 2,153 runs
  • [sig-auth] k8s.io/kubernetes/pkg/registry/certificates/clustertrustbundle.storage 2,153 runs
  • [sig-auth] k8s.io/kubernetes/pkg/registry/certificates/podcertificaterequest.storage 2,153 runs
  • [sig-auth] k8s.io/kubernetes/pkg/registry/core.serviceaccount 2,153 runs
  • [sig-auth] k8s.io/kubernetes/pkg/registry/core/serviceaccount.storage 2,153 runs
  • [sig-auth] k8s.io/kubernetes/pkg/registry/rbac.rest 2,153 runs
  • [sig-auth] k8s.io/kubernetes/pkg/registry/rbac.validation 2,153 runs
  • [sig-auth] k8s.io/kubernetes/pkg/registry/rbac/clusterrole.policybased 2,153 runs
  • [sig-auth] k8s.io/kubernetes/pkg/registry/rbac/role.policybased 2,153 runs
  • [sig-auth] k8s.io/kubernetes/pkg/serviceaccount/externaljwt.metrics 2,153 runs
  • [sig-auth] k8s.io/kubernetes/pkg/serviceaccount/externaljwt.plugin 2,153 runs
  • [sig-auth] k8s.io/kubernetes/plugin/pkg/admission.imagepolicy 2,153 runs
  • [sig-auth] k8s.io/kubernetes/plugin/pkg/admission.noderestriction 2,153 runs
  • [sig-auth] k8s.io/kubernetes/plugin/pkg/admission.serviceaccount 2,153 runs
  • [sig-auth] k8s.io/kubernetes/plugin/pkg/admission/certificates.approval 2,153 runs
  • [sig-auth] k8s.io/kubernetes/plugin/pkg/admission/certificates.ctbattest 2,153 runs
  • [sig-auth] k8s.io/kubernetes/plugin/pkg/admission/certificates.signing 2,153 runs
  • [sig-auth] k8s.io/kubernetes/plugin/pkg/admission/certificates.subjectrestriction 2,153 runs
  • [sig-auth] k8s.io/kubernetes/plugin/pkg/auth/authenticator/token.bootstrap 2,153 runs
  • [sig-auth] k8s.io/kubernetes/plugin/pkg/auth/authorizer.node 2,153 runs
  • [sig-auth] k8s.io/kubernetes/plugin/pkg/auth/authorizer.rbac 2,153 runs
  • [sig-auth] k8s.io/kubernetes/plugin/pkg/auth/authorizer/rbac.bootstrappolicy 2,153 runs
  • [sig-auth] k8s.io/pod-security-admission.admission 2,153 runs
  • [sig-auth] k8s.io/pod-security-admission.api 2,153 runs
  • [sig-auth] k8s.io/pod-security-admission.metrics 2,153 runs
  • [sig-auth] k8s.io/pod-security-admission.policy 2,153 runs
  • [sig-auth] k8s.io/pod-security-admission.test 2,153 runs
  • [sig-auth] k8s.io/pod-security-admission/admission.api 2,153 runs
  • [sig-auth] k8s.io/pod-security-admission/admission/api.load 2,153 runs
  • [sig-auth] k8s.io/pod-security-admission/admission/api.scheme 2,153 runs
  • [sig-auth] k8s.io/pod-security-admission/admission/api.v1 2,153 runs
  • [sig-auth] k8s.io/pod-security-admission/admission/api.v1alpha1 2,153 runs
  • [sig-auth] k8s.io/pod-security-admission/admission/api.v1beta1 2,153 runs
  • [sig-auth] k8s.io/pod-security-admission/admission/api.validation 2,153 runs
  • [sig-autoscaling] k8s.io/component-helpers/nodedeclaredfeatures.features 2,153 runs
  • [sig-autoscaling] k8s.io/component-helpers/nodedeclaredfeatures/features.dranodeallocatableresources 1,817 runs
  • [sig-autoscaling] k8s.io/component-helpers/nodedeclaredfeatures/features.draoptionalnodeoperations 1,796 runs
  • [sig-autoscaling] k8s.io/component-helpers/nodedeclaredfeatures/features.extendwebsocketstokubelet 2,153 runs
  • [sig-autoscaling] k8s.io/component-helpers/nodedeclaredfeatures/features.inplacepodresize 2,153 runs
  • [sig-autoscaling] k8s.io/component-helpers/nodedeclaredfeatures/features.podcertificatesmldsa 484 runs
  • [sig-autoscaling] k8s.io/component-helpers/nodedeclaredfeatures/features.restartallcontainers 2,153 runs
  • [sig-autoscaling] k8s.io/component-helpers/nodedeclaredfeatures/features.usernamespaceshostnetwork 2,153 runs
  • [sig-autoscaling] k8s.io/kubernetes/pkg/controller.podautoscaler 2,153 runs
  • [sig-autoscaling] k8s.io/kubernetes/pkg/controller/podautoscaler.metrics 2,153 runs
  • [sig-cli] k8s.io/cli-runtime/pkg.genericclioptions 2,153 runs
  • [sig-cli] k8s.io/cli-runtime/pkg.printers 2,153 runs
  • [sig-cli] k8s.io/cli-runtime/pkg.resource 2,153 runs
  • [sig-cli] k8s.io/component-base/cli.flag 2,153 runs
  • [sig-cli] k8s.io/component-base/cli.globalflag 2,153 runs
  • [sig-cli] k8s.io/kubectl/pkg.apps 2,153 runs
  • [sig-cli] k8s.io/kubectl/pkg.cmd 2,153 runs
  • [sig-cli] k8s.io/kubectl/pkg.describe 2,153 runs
  • [sig-cli] k8s.io/kubectl/pkg.drain 2,153 runs
  • [sig-cli] k8s.io/kubectl/pkg.explain 2,153 runs
  • [sig-cli] k8s.io/kubectl/pkg.kuberc 2,153 runs
  • [sig-cli] k8s.io/kubectl/pkg.metricsutil 2,153 runs
  • [sig-cli] k8s.io/kubectl/pkg.polymorphichelpers 2,153 runs
  • [sig-cli] k8s.io/kubectl/pkg.proxy 2,153 runs
  • [sig-cli] k8s.io/kubectl/pkg.scale 2,153 runs
  • [sig-cli] k8s.io/kubectl/pkg.scheme 2,153 runs
  • [sig-cli] k8s.io/kubectl/pkg.util 2,153 runs
  • [sig-cli] k8s.io/kubectl/pkg.validation 2,153 runs
  • [sig-cli] k8s.io/kubectl/pkg/cmd.annotate 2,153 runs
  • [sig-cli] k8s.io/kubectl/pkg/cmd.apiresources 2,153 runs
  • [sig-cli] k8s.io/kubectl/pkg/cmd.apply 2,153 runs
  • [sig-cli] k8s.io/kubectl/pkg/cmd.attach 2,153 runs
  • [sig-cli] k8s.io/kubectl/pkg/cmd.autoscale 2,153 runs
  • [sig-cli] k8s.io/kubectl/pkg/cmd.certificates 2,153 runs
  • [sig-cli] k8s.io/kubectl/pkg/cmd.clusterinfo 2,153 runs
  • [sig-cli] k8s.io/kubectl/pkg/cmd.completion 2,153 runs
  • [sig-cli] k8s.io/kubectl/pkg/cmd.config 2,153 runs
  • [sig-cli] k8s.io/kubectl/pkg/cmd.cp 2,153 runs
  • [sig-cli] k8s.io/kubectl/pkg/cmd.create 2,153 runs
  • [sig-cli] k8s.io/kubectl/pkg/cmd.debug 2,153 runs
  • [sig-cli] k8s.io/kubectl/pkg/cmd.delete 2,153 runs
  • [sig-cli] k8s.io/kubectl/pkg/cmd.describe 2,153 runs
  • [sig-cli] k8s.io/kubectl/pkg/cmd.diff 2,153 runs
  • [sig-cli] k8s.io/kubectl/pkg/cmd.drain 2,153 runs
  • [sig-cli] k8s.io/kubectl/pkg/cmd.edit 2,153 runs
  • [sig-cli] k8s.io/kubectl/pkg/cmd.events 2,153 runs
  • [sig-cli] k8s.io/kubectl/pkg/cmd.exec 2,153 runs
  • [sig-cli] k8s.io/kubectl/pkg/cmd.explain 2,153 runs
  • [sig-cli] k8s.io/kubectl/pkg/cmd.expose 2,153 runs
  • [sig-cli] k8s.io/kubectl/pkg/cmd.get 2,153 runs
  • [sig-cli] k8s.io/kubectl/pkg/cmd.kuberc 2,153 runs
  • [sig-cli] k8s.io/kubectl/pkg/cmd.label 2,153 runs
  • [sig-cli] k8s.io/kubectl/pkg/cmd.logs 2,153 runs
  • [sig-cli] k8s.io/kubectl/pkg/cmd.patch 2,153 runs
  • [sig-cli] k8s.io/kubectl/pkg/cmd.plugin 2,153 runs
  • [sig-cli] k8s.io/kubectl/pkg/cmd.portforward 2,153 runs
  • [sig-cli] k8s.io/kubectl/pkg/cmd.replace 2,153 runs
  • [sig-cli] k8s.io/kubectl/pkg/cmd.rollout 2,153 runs
  • [sig-cli] k8s.io/kubectl/pkg/cmd.run 2,153 runs
  • [sig-cli] k8s.io/kubectl/pkg/cmd.set 2,153 runs
  • [sig-cli] k8s.io/kubectl/pkg/cmd.taint 2,153 runs
  • [sig-cli] k8s.io/kubectl/pkg/cmd.top 2,153 runs
  • [sig-cli] k8s.io/kubectl/pkg/cmd.util 2,153 runs
  • [sig-cli] k8s.io/kubectl/pkg/cmd.version 2,153 runs
  • [sig-cli] k8s.io/kubectl/pkg/cmd.wait 2,153 runs
  • [sig-cli] k8s.io/kubectl/pkg/cmd/set.env 2,153 runs
  • [sig-cli] k8s.io/kubectl/pkg/cmd/util.editor 2,153 runs
  • [sig-cli] k8s.io/kubectl/pkg/config.scheme 2,153 runs
  • [sig-cli] k8s.io/kubectl/pkg/explain.v2 2,153 runs
  • [sig-cli] k8s.io/kubectl/pkg/explain/v2.templates 2,153 runs
  • [sig-cli] k8s.io/kubectl/pkg/util.completion 2,153 runs
  • [sig-cli] k8s.io/kubectl/pkg/util.event 2,153 runs
  • [sig-cli] k8s.io/kubectl/pkg/util.hash 2,153 runs
  • [sig-cli] k8s.io/kubectl/pkg/util.i18n 2,153 runs
  • [sig-cli] k8s.io/kubectl/pkg/util.openapi 2,153 runs
  • [sig-cli] k8s.io/kubectl/pkg/util.podutils 2,153 runs
  • [sig-cli] k8s.io/kubectl/pkg/util.prune 2,153 runs
  • [sig-cli] k8s.io/kubectl/pkg/util.qos 2,153 runs
  • [sig-cli] k8s.io/kubectl/pkg/util.resource 2,153 runs
  • [sig-cli] k8s.io/kubectl/pkg/util.slice 2,153 runs
  • [sig-cli] k8s.io/kubectl/pkg/util.storage 2,153 runs
  • [sig-cli] k8s.io/kubectl/pkg/util.templates 2,153 runs
  • [sig-cli] k8s.io/kubectl/pkg/util.term 2,153 runs
  • [sig-cli] k8s.io/kubernetes/pkg/kubectl/cmd.convert 2,153 runs
  • [sig-cloud-provider] k8s.io/cloud-provider.app 2,153 runs
  • [sig-cloud-provider] k8s.io/cloud-provider.options 2,153 runs
  • [sig-cloud-provider] k8s.io/cloud-provider/config.v1alpha1 2,153 runs
  • [sig-cloud-provider] k8s.io/cloud-provider/controllers.node 2,153 runs
  • [sig-cloud-provider] k8s.io/cloud-provider/controllers.nodelifecycle 2,153 runs
  • [sig-cloud-provider] k8s.io/cloud-provider/controllers.route 2,153 runs
  • [sig-cloud-provider] k8s.io/cloud-provider/node.helpers 2,153 runs
  • [sig-cloud-provider] k8s.io/cloud-provider/service.helpers 2,153 runs
  • [sig-cloud-provider] k8s.io/cloud-provider/volume.helpers 2,153 runs
  • [sig-cloud-provider] k8s.io/kubernetes/cluster/gce.gci 2,153 runs
  • [sig-cluster-lifecycle] k8s.io/cluster-bootstrap/token.jws 2,153 runs
  • [sig-cluster-lifecycle] k8s.io/cluster-bootstrap/token.util 2,153 runs
  • [sig-cluster-lifecycle] k8s.io/cluster-bootstrap/util.secrets 2,153 runs
  • [sig-cluster-lifecycle] k8s.io/component-base.configz 2,153 runs
  • [sig-cluster-lifecycle] k8s.io/kubernetes/cmd/kubeadm/app.cmd 2,153 runs
  • [sig-cluster-lifecycle] k8s.io/kubernetes/cmd/kubeadm/app.componentconfigs 2,153 runs
  • [sig-cluster-lifecycle] k8s.io/kubernetes/cmd/kubeadm/app.constants 2,153 runs
  • [sig-cluster-lifecycle] k8s.io/kubernetes/cmd/kubeadm/app.discovery 2,153 runs
  • [sig-cluster-lifecycle] k8s.io/kubernetes/cmd/kubeadm/app.features 2,153 runs
  • [sig-cluster-lifecycle] k8s.io/kubernetes/cmd/kubeadm/app.images 2,153 runs
  • [sig-cluster-lifecycle] k8s.io/kubernetes/cmd/kubeadm/app.preflight 2,153 runs
  • [sig-cluster-lifecycle] k8s.io/kubernetes/cmd/kubeadm/app.util 2,153 runs
  • [sig-cluster-lifecycle] k8s.io/kubernetes/cmd/kubeadm/app/apis.kubeadm 2,153 runs
  • [sig-cluster-lifecycle] k8s.io/kubernetes/cmd/kubeadm/app/apis/bootstraptoken.v1 2,153 runs
  • [sig-cluster-lifecycle] k8s.io/kubernetes/cmd/kubeadm/app/apis/kubeadm.fuzzer 2,153 runs
  • [sig-cluster-lifecycle] k8s.io/kubernetes/cmd/kubeadm/app/apis/kubeadm.validation 2,153 runs
  • [sig-cluster-lifecycle] k8s.io/kubernetes/cmd/kubeadm/app/apis/output.fuzzer 2,153 runs
  • [sig-cluster-lifecycle] k8s.io/kubernetes/cmd/kubeadm/app/cmd.options 2,153 runs
  • [sig-cluster-lifecycle] k8s.io/kubernetes/cmd/kubeadm/app/cmd.phases 2,153 runs
  • [sig-cluster-lifecycle] k8s.io/kubernetes/cmd/kubeadm/app/cmd.upgrade 2,153 runs
  • [sig-cluster-lifecycle] k8s.io/kubernetes/cmd/kubeadm/app/cmd.util 2,153 runs
  • [sig-cluster-lifecycle] k8s.io/kubernetes/cmd/kubeadm/app/cmd/phases.init 2,153 runs
  • [sig-cluster-lifecycle] k8s.io/kubernetes/cmd/kubeadm/app/cmd/phases.reset 2,153 runs
  • [sig-cluster-lifecycle] k8s.io/kubernetes/cmd/kubeadm/app/cmd/phases.workflow 2,153 runs
  • [sig-cluster-lifecycle] k8s.io/kubernetes/cmd/kubeadm/app/cmd/phases/upgrade.apply 2,153 runs
  • [sig-cluster-lifecycle] k8s.io/kubernetes/cmd/kubeadm/app/cmd/phases/upgrade.node 2,153 runs
  • [sig-cluster-lifecycle] k8s.io/kubernetes/cmd/kubeadm/app/discovery.token 2,153 runs
  • [sig-cluster-lifecycle] k8s.io/kubernetes/cmd/kubeadm/app/phases.certs 2,153 runs
  • [sig-cluster-lifecycle] k8s.io/kubernetes/cmd/kubeadm/app/phases.controlplane 2,153 runs
  • [sig-cluster-lifecycle] k8s.io/kubernetes/cmd/kubeadm/app/phases.copycerts 2,153 runs
  • [sig-cluster-lifecycle] k8s.io/kubernetes/cmd/kubeadm/app/phases.etcd 2,153 runs
  • [sig-cluster-lifecycle] k8s.io/kubernetes/cmd/kubeadm/app/phases.kubeconfig 2,153 runs
  • [sig-cluster-lifecycle] k8s.io/kubernetes/cmd/kubeadm/app/phases.kubelet 2,153 runs
  • [sig-cluster-lifecycle] k8s.io/kubernetes/cmd/kubeadm/app/phases.markcontrolplane 2,153 runs
  • [sig-cluster-lifecycle] k8s.io/kubernetes/cmd/kubeadm/app/phases.upgrade 2,153 runs
  • [sig-cluster-lifecycle] k8s.io/kubernetes/cmd/kubeadm/app/phases.uploadconfig 2,153 runs
  • [sig-cluster-lifecycle] k8s.io/kubernetes/cmd/kubeadm/app/phases/addons.dns 2,153 runs
  • [sig-cluster-lifecycle] k8s.io/kubernetes/cmd/kubeadm/app/phases/addons.proxy 2,153 runs
  • [sig-cluster-lifecycle] k8s.io/kubernetes/cmd/kubeadm/app/phases/bootstraptoken.clusterinfo 2,153 runs
  • [sig-cluster-lifecycle] k8s.io/kubernetes/cmd/kubeadm/app/phases/bootstraptoken.node 2,153 runs
  • [sig-cluster-lifecycle] k8s.io/kubernetes/cmd/kubeadm/app/phases/certs.renewal 2,153 runs
  • [sig-cluster-lifecycle] k8s.io/kubernetes/cmd/kubeadm/app/util.apiclient 2,153 runs
  • [sig-cluster-lifecycle] k8s.io/kubernetes/cmd/kubeadm/app/util.config 2,153 runs
  • [sig-cluster-lifecycle] k8s.io/kubernetes/cmd/kubeadm/app/util.crypto 2,153 runs
  • [sig-cluster-lifecycle] k8s.io/kubernetes/cmd/kubeadm/app/util.dryrun 2,153 runs
  • [sig-cluster-lifecycle] k8s.io/kubernetes/cmd/kubeadm/app/util.errors 2,153 runs
  • [sig-cluster-lifecycle] k8s.io/kubernetes/cmd/kubeadm/app/util.etcd 2,153 runs
  • [sig-cluster-lifecycle] k8s.io/kubernetes/cmd/kubeadm/app/util.image 2,153 runs
  • [sig-cluster-lifecycle] k8s.io/kubernetes/cmd/kubeadm/app/util.initsystem 640 runs
  • [sig-cluster-lifecycle] k8s.io/kubernetes/cmd/kubeadm/app/util.kubeconfig 2,153 runs
  • [sig-cluster-lifecycle] k8s.io/kubernetes/cmd/kubeadm/app/util.patches 2,153 runs
  • [sig-cluster-lifecycle] k8s.io/kubernetes/cmd/kubeadm/app/util.pkiutil 2,153 runs
  • [sig-cluster-lifecycle] k8s.io/kubernetes/cmd/kubeadm/app/util.pubkeypin 2,153 runs
  • [sig-cluster-lifecycle] k8s.io/kubernetes/cmd/kubeadm/app/util.runtime 2,153 runs
  • [sig-cluster-lifecycle] k8s.io/kubernetes/cmd/kubeadm/app/util.staticpod 2,153 runs
  • [sig-cluster-lifecycle] k8s.io/kubernetes/cmd/kubeadm/app/util.users 2,153 runs
  • [sig-cluster-lifecycle] k8s.io/kubernetes/cmd/kubeadm/app/util/config.strict 2,153 runs
  • [sig-etcd] k8s.io/apiserver/pkg/storage/etcd3.metrics 2,153 runs
  • [sig-etcd] k8s.io/apiserver/pkg/storage/etcd3.preflight 2,153 runs
  • [sig-etcd] k8s.io/apiserver/pkg/storage/etcd3.testserver 810 runs
  • [sig-instrumentation] k8s.io/apiserver/pkg/server.flagz 2,153 runs
  • [sig-instrumentation] k8s.io/apiserver/pkg/server.statusz 2,153 runs
  • [sig-instrumentation] k8s.io/apiserver/pkg/storage.metrics 2,153 runs
  • [sig-instrumentation] k8s.io/component-base.logs 2,153 runs
  • [sig-instrumentation] k8s.io/component-base.metrics 2,153 runs
  • [sig-instrumentation] k8s.io/component-base.tracing 2,153 runs
  • [sig-instrumentation] k8s.io/component-base/logs.datapol 2,153 runs
  • [sig-instrumentation] k8s.io/component-base/logs.json 2,153 runs
  • [sig-instrumentation] k8s.io/component-base/logs.kube-log-runner 2,153 runs
  • [sig-instrumentation] k8s.io/component-base/logs.logreduction 2,153 runs
  • [sig-instrumentation] k8s.io/component-base/logs/api.v1 2,153 runs
  • [sig-instrumentation] k8s.io/component-base/logs/example.test 2,153 runs
  • [sig-instrumentation] k8s.io/component-base/logs/json.register 2,153 runs
  • [sig-instrumentation] k8s.io/component-base/logs/kube-log-runner/internal.logrotation 2,153 runs
  • [sig-instrumentation] k8s.io/component-base/metrics.legacyregistry 2,153 runs
  • [sig-instrumentation] k8s.io/component-base/metrics.prometheusextension 2,153 runs
  • [sig-instrumentation] k8s.io/component-base/metrics.testutil 2,153 runs
  • [sig-instrumentation] k8s.io/component-base/metrics/api.v1 2,153 runs
  • [sig-instrumentation] k8s.io/component-base/metrics/prometheus.compatversion 2,153 runs
  • [sig-instrumentation] k8s.io/component-base/metrics/prometheus.controllers 2,153 runs
  • [sig-instrumentation] k8s.io/component-base/metrics/prometheus.feature 2,153 runs
  • [sig-instrumentation] k8s.io/component-base/metrics/prometheus.restclient 2,153 runs
  • [sig-instrumentation] k8s.io/component-base/metrics/prometheus.slis 2,153 runs
  • [sig-instrumentation] k8s.io/component-base/tracing/api.v1 2,153 runs
  • [sig-instrumentation] k8s.io/metrics/pkg.apis 2,153 runs
  • [sig-instrumentation] k8s.io/metrics/pkg/client.clientset_test 2,153 runs
  • [sig-instrumentation] k8s.io/metrics/pkg/client.custom_metrics 2,153 runs
  • [sig-network] k8s.io.endpointslice 2,153 runs
  • [sig-network] k8s.io/cloud-provider/controllers.service 2,153 runs
  • [sig-network] k8s.io/endpointslice.metrics 2,153 runs
  • [sig-network] k8s.io/endpointslice.topologycache 2,153 runs
  • [sig-network] k8s.io/endpointslice.trafficdist 2,153 runs
  • [sig-network] k8s.io/endpointslice.util 2,153 runs
  • [sig-network] k8s.io/kube-proxy/config.v1alpha1 2,153 runs
  • [sig-network] k8s.io/kubernetes/cmd/kube-proxy.app 2,153 runs
  • [sig-network] k8s.io/kubernetes/pkg.proxy 2,153 runs
  • [sig-network] k8s.io/kubernetes/pkg/apis/networking.v1 2,153 runs
  • [sig-network] k8s.io/kubernetes/pkg/apis/networking.v1beta1 2,153 runs
  • [sig-network] k8s.io/kubernetes/pkg/apis/networking.validation 2,153 runs
  • [sig-network] k8s.io/kubernetes/pkg/controller.endpointslice 2,153 runs
  • [sig-network] k8s.io/kubernetes/pkg/controller.endpointslicemirroring 2,153 runs
  • [sig-network] k8s.io/kubernetes/pkg/controller.servicecidrs 2,153 runs
  • [sig-network] k8s.io/kubernetes/pkg/controller/endpointslicemirroring.metrics 2,153 runs
  • [sig-network] k8s.io/kubernetes/pkg/controller/nodeipam.ipam 2,153 runs
  • [sig-network] k8s.io/kubernetes/pkg/controller/nodeipam/ipam.cidrset 2,153 runs
  • [sig-network] k8s.io/kubernetes/pkg/controlplane/controller.defaultservicecidr 2,153 runs
  • [sig-network] k8s.io/kubernetes/pkg/kubelet/network.dns 2,153 runs
  • [sig-network] k8s.io/kubernetes/pkg/proxy.config 2,153 runs
  • [sig-network] k8s.io/kubernetes/pkg/proxy.conntrack 2,153 runs
  • [sig-network] k8s.io/kubernetes/pkg/proxy.healthcheck 2,153 runs
  • [sig-network] k8s.io/kubernetes/pkg/proxy.iptables 2,153 runs
  • [sig-network] k8s.io/kubernetes/pkg/proxy.ipvs 2,153 runs
  • [sig-network] k8s.io/kubernetes/pkg/proxy.metaproxier 2,153 runs
  • [sig-network] k8s.io/kubernetes/pkg/proxy.metrics 1,855 runs
  • [sig-network] k8s.io/kubernetes/pkg/proxy.nftables 2,153 runs
  • [sig-network] k8s.io/kubernetes/pkg/proxy.nodemanager 7 runs
  • [sig-network] k8s.io/kubernetes/pkg/proxy.runner 2,153 runs
  • [sig-network] k8s.io/kubernetes/pkg/proxy.util 2,153 runs
  • [sig-network] k8s.io/kubernetes/pkg/proxy/apis.config 2,153 runs
  • [sig-network] k8s.io/kubernetes/pkg/proxy/apis/config.scheme 2,153 runs
  • [sig-network] k8s.io/kubernetes/pkg/proxy/apis/config.v1alpha1 2,153 runs
  • [sig-network] k8s.io/kubernetes/pkg/proxy/apis/config.validation 2,153 runs
  • [sig-network] k8s.io/kubernetes/pkg/proxy/ipvs.ipset 2,153 runs
  • [sig-network] k8s.io/kubernetes/pkg/proxy/ipvs.testing 2,153 runs
  • [sig-network] k8s.io/kubernetes/pkg/proxy/ipvs.util 2,153 runs
  • [sig-network] k8s.io/kubernetes/pkg/proxy/ipvs/ipset.testing 2,153 runs
  • [sig-network] k8s.io/kubernetes/pkg/proxy/ipvs/util.testing 2,153 runs
  • [sig-network] k8s.io/kubernetes/pkg/proxy/util.nfacct 2,153 runs
  • [sig-network] k8s.io/kubernetes/pkg/util.iptables 2,153 runs
  • [sig-network] k8s.io/kubernetes/pkg/util/iptables.testing 2,153 runs
  • [sig-node] k8s.io/component-helpers.nodedeclaredfeatures 2,153 runs
  • [sig-node] k8s.io/component-helpers.resource 2,153 runs
  • [sig-node] k8s.io/component-helpers/node.topology 2,153 runs
  • [sig-node] k8s.io/component-helpers/node.util 2,153 runs
  • [sig-node] k8s.io/component-helpers/node/util.sysctl 2,153 runs
  • [sig-node] k8s.io/cri-streaming/pkg.streaming 2,153 runs
  • [sig-node] k8s.io/cri-streaming/pkg/streaming.portforward 2,153 runs
  • [sig-node] k8s.io/cri-streaming/pkg/streaming.remotecommand 2,153 runs
  • [sig-node] k8s.io/dynamic-resource-allocation.api 2,153 runs
  • [sig-node] k8s.io/dynamic-resource-allocation.cel 2,153 runs
  • [sig-node] k8s.io/dynamic-resource-allocation.client 2,153 runs
  • [sig-node] k8s.io/dynamic-resource-allocation.deviceattribute 2,153 runs
  • [sig-node] k8s.io/dynamic-resource-allocation.devicemetadata 2,153 runs
  • [sig-node] k8s.io/dynamic-resource-allocation.kubeletplugin 2,153 runs
  • [sig-node] k8s.io/dynamic-resource-allocation.resourceclaim 2,153 runs
  • [sig-node] k8s.io/dynamic-resource-allocation.structured 2,153 runs
  • [sig-node] k8s.io/dynamic-resource-allocation/api.v1beta1 2,153 runs
  • [sig-node] k8s.io/dynamic-resource-allocation/api.v1beta2 2,153 runs
  • [sig-node] k8s.io/dynamic-resource-allocation/api/metadata.install 2,153 runs
  • [sig-node] k8s.io/dynamic-resource-allocation/api/metadata.v1alpha1 2,153 runs
  • [sig-node] k8s.io/dynamic-resource-allocation/api/metadata.v1beta1 1,854 runs
  • [sig-node] k8s.io/dynamic-resource-allocation/deviceclass.extendedresourcecache 2,153 runs
  • [sig-node] k8s.io/dynamic-resource-allocation/resourceslice.tracker 2,153 runs
  • [sig-node] k8s.io/dynamic-resource-allocation/structured.schedulerapi 18 runs
  • [sig-node] k8s.io/dynamic-resource-allocation/structured/internal.experimental 2,153 runs
  • [sig-node] k8s.io/dynamic-resource-allocation/structured/internal.incubating 2,153 runs
  • [sig-node] k8s.io/dynamic-resource-allocation/structured/internal.stable 2,153 runs
  • [sig-node] k8s.io/kubelet/pkg/apis/dra-health.v1 1,831 runs
  • [sig-node] k8s.io/kubernetes/cmd/kubelet/app.options 2,153 runs
  • [sig-node] k8s.io/kubernetes/pkg.kubelet 2,153 runs
  • [sig-node] k8s.io/kubernetes/pkg.probe 2,153 runs
  • [sig-node] k8s.io/kubernetes/pkg.securitycontext 2,153 runs
  • [sig-node] k8s.io/kubernetes/pkg/controller.nodelifecycle 2,153 runs
  • [sig-node] k8s.io/kubernetes/pkg/controller.resourceclaim 2,153 runs
  • [sig-node] k8s.io/kubernetes/pkg/controller/resourceclaim/config.v1alpha1 2,153 runs
  • [sig-node] k8s.io/kubernetes/pkg/kubelet.allocation 2,153 runs
  • [sig-node] k8s.io/kubernetes/pkg/kubelet.cadvisor 2,153 runs
  • [sig-node] k8s.io/kubernetes/pkg/kubelet.checkpointmanager 2,153 runs
  • [sig-node] k8s.io/kubernetes/pkg/kubelet.client 2,153 runs
  • [sig-node] k8s.io/kubernetes/pkg/kubelet.clustertrustbundle 2,153 runs
  • [sig-node] k8s.io/kubernetes/pkg/kubelet.cm 2,153 runs
  • [sig-node] k8s.io/kubernetes/pkg/kubelet.config 2,153 runs
  • [sig-node] k8s.io/kubernetes/pkg/kubelet.configmap 2,153 runs
  • [sig-node] k8s.io/kubernetes/pkg/kubelet.container 2,153 runs
  • [sig-node] k8s.io/kubernetes/pkg/kubelet.envvars 2,153 runs
  • [sig-node] k8s.io/kubernetes/pkg/kubelet.events 2,153 runs
  • [sig-node] k8s.io/kubernetes/pkg/kubelet.eviction 2,153 runs
  • [sig-node] k8s.io/kubernetes/pkg/kubelet.images 2,153 runs
  • [sig-node] k8s.io/kubernetes/pkg/kubelet.lifecycle 2,153 runs
  • [sig-node] k8s.io/kubernetes/pkg/kubelet.logs 2,153 runs
  • [sig-node] k8s.io/kubernetes/pkg/kubelet.metrics 2,153 runs
  • [sig-node] k8s.io/kubernetes/pkg/kubelet.nodeshutdown 2,153 runs
  • [sig-node] k8s.io/kubernetes/pkg/kubelet.nodestatus 2,153 runs
  • [sig-node] k8s.io/kubernetes/pkg/kubelet.oom 2,153 runs
  • [sig-node] k8s.io/kubernetes/pkg/kubelet.pleg 2,153 runs
  • [sig-node] k8s.io/kubernetes/pkg/kubelet.pluginmanager 2,153 runs
  • [sig-node] k8s.io/kubernetes/pkg/kubelet.pod 2,153 runs
  • [sig-node] k8s.io/kubernetes/pkg/kubelet.preemption 2,153 runs
  • [sig-node] k8s.io/kubernetes/pkg/kubelet.prober 2,153 runs
  • [sig-node] k8s.io/kubernetes/pkg/kubelet.qos 2,153 runs
  • [sig-node] k8s.io/kubernetes/pkg/kubelet.runtimeclass 2,153 runs
  • [sig-node] k8s.io/kubernetes/pkg/kubelet.secret 2,153 runs
  • [sig-node] k8s.io/kubernetes/pkg/kubelet.server 2,153 runs
  • [sig-node] k8s.io/kubernetes/pkg/kubelet.stats 2,153 runs
  • [sig-node] k8s.io/kubernetes/pkg/kubelet.status 2,153 runs
  • [sig-node] k8s.io/kubernetes/pkg/kubelet.sysctl 2,153 runs
  • [sig-node] k8s.io/kubernetes/pkg/kubelet.types 2,153 runs
  • [sig-node] k8s.io/kubernetes/pkg/kubelet.userns 2,153 runs
  • [sig-node] k8s.io/kubernetes/pkg/kubelet.util 2,153 runs
  • [sig-node] k8s.io/kubernetes/pkg/kubelet.watchdog 2,153 runs
  • [sig-node] k8s.io/kubernetes/pkg/kubelet/allocation.state 2,153 runs
  • [sig-node] k8s.io/kubernetes/pkg/kubelet/apis.config 2,153 runs
  • [sig-node] k8s.io/kubernetes/pkg/kubelet/apis.grpc 224 runs
  • [sig-node] k8s.io/kubernetes/pkg/kubelet/apis.podresources 2,153 runs
  • [sig-node] k8s.io/kubernetes/pkg/kubelet/apis.pods 2,153 runs
  • [sig-node] k8s.io/kubernetes/pkg/kubelet/apis/config.scheme 2,153 runs
  • [sig-node] k8s.io/kubernetes/pkg/kubelet/apis/config.v1beta1 2,153 runs
  • [sig-node] k8s.io/kubernetes/pkg/kubelet/apis/config.validation 2,153 runs
  • [sig-node] k8s.io/kubernetes/pkg/kubelet/cm.admission 2,153 runs
  • [sig-node] k8s.io/kubernetes/pkg/kubelet/cm.containermap 2,153 runs
  • [sig-node] k8s.io/kubernetes/pkg/kubelet/cm.cpumanager 2,153 runs
  • [sig-node] k8s.io/kubernetes/pkg/kubelet/cm.devicemanager 2,153 runs
  • [sig-node] k8s.io/kubernetes/pkg/kubelet/cm.dra 2,153 runs
  • [sig-node] k8s.io/kubernetes/pkg/kubelet/cm.memorymanager 2,153 runs
  • [sig-node] k8s.io/kubernetes/pkg/kubelet/cm.qos 2,153 runs
  • [sig-node] k8s.io/kubernetes/pkg/kubelet/cm.topologymanager 2,153 runs
  • [sig-node] k8s.io/kubernetes/pkg/kubelet/cm/cpumanager.state 2,153 runs
  • [sig-node] k8s.io/kubernetes/pkg/kubelet/cm/cpumanager.topology 2,153 runs
  • [sig-node] k8s.io/kubernetes/pkg/kubelet/cm/dra.plugin 2,153 runs
  • [sig-node] k8s.io/kubernetes/pkg/kubelet/cm/dra.state 2,153 runs
  • [sig-node] k8s.io/kubernetes/pkg/kubelet/cm/memorymanager.state 2,153 runs
  • [sig-node] k8s.io/kubernetes/pkg/kubelet/cm/topologymanager.bitmask 2,153 runs
  • [sig-node] k8s.io/kubernetes/pkg/kubelet/images.pullmanager 2,153 runs
  • [sig-node] k8s.io/kubernetes/pkg/kubelet/kubeletconfig.configfiles 2,153 runs
  • [sig-node] k8s.io/kubernetes/pkg/kubelet/kuberuntime.util 2,153 runs
  • [sig-node] k8s.io/kubernetes/pkg/kubelet/metrics.collectors 2,153 runs
  • [sig-node] k8s.io/kubernetes/pkg/kubelet/metrics.cri 993 runs
  • [sig-node] k8s.io/kubernetes/pkg/kubelet/nodeshutdown.systemd 2,153 runs
  • [sig-node] k8s.io/kubernetes/pkg/kubelet/pluginmanager.cache 2,153 runs
  • [sig-node] k8s.io/kubernetes/pkg/kubelet/pluginmanager.metrics 2,153 runs
  • [sig-node] k8s.io/kubernetes/pkg/kubelet/pluginmanager.operationexecutor 2,153 runs
  • [sig-node] k8s.io/kubernetes/pkg/kubelet/pluginmanager.pluginwatcher 2,153 runs
  • [sig-node] k8s.io/kubernetes/pkg/kubelet/pluginmanager.reconciler 2,153 runs
  • [sig-node] k8s.io/kubernetes/pkg/kubelet/prober.results 2,153 runs
  • [sig-node] k8s.io/kubernetes/pkg/kubelet/server.metrics 2,153 runs
  • [sig-node] k8s.io/kubernetes/pkg/kubelet/server.stats 2,153 runs
  • [sig-node] k8s.io/kubernetes/pkg/kubelet/util.cache 2,153 runs
  • [sig-node] k8s.io/kubernetes/pkg/kubelet/util.env 2,153 runs
  • [sig-node] k8s.io/kubernetes/pkg/kubelet/util.format 2,153 runs
  • [sig-node] k8s.io/kubernetes/pkg/kubelet/util.ioutils 2,153 runs
  • [sig-node] k8s.io/kubernetes/pkg/kubelet/util.manager 2,153 runs
  • [sig-node] k8s.io/kubernetes/pkg/kubelet/util.queue 2,153 runs
  • [sig-node] k8s.io/kubernetes/pkg/kubelet/util.sliceutils 2,153 runs
  • [sig-node] k8s.io/kubernetes/pkg/kubelet/util.store 2,153 runs
  • [sig-node] k8s.io/kubernetes/pkg/kubelet/util.swap 2,153 runs
  • [sig-node] k8s.io/kubernetes/pkg/kubelet/volumemanager.cache 2,153 runs
  • [sig-node] k8s.io/kubernetes/pkg/kubelet/volumemanager.metrics 2,153 runs
  • [sig-node] k8s.io/kubernetes/pkg/kubelet/volumemanager.populator 2,153 runs
  • [sig-node] k8s.io/kubernetes/pkg/kubelet/volumemanager.volumehealth 1,833 runs
  • [sig-node] k8s.io/kubernetes/pkg/probe.exec 2,153 runs
  • [sig-node] k8s.io/kubernetes/pkg/probe.grpc 2,153 runs
  • [sig-node] k8s.io/kubernetes/pkg/probe.http 2,153 runs
  • [sig-node] k8s.io/kubernetes/pkg/probe.tcp 2,153 runs
  • [sig-node] k8s.io/kubernetes/pkg/registry/core.node 2,153 runs
  • [sig-node] k8s.io/kubernetes/pkg/registry/core.pod 2,153 runs
  • [sig-node] k8s.io/kubernetes/pkg/registry/core.podtemplate 2,153 runs
  • [sig-node] k8s.io/kubernetes/pkg/registry/core/node.storage 2,153 runs
  • [sig-node] k8s.io/kubernetes/pkg/registry/core/pod.rest 2,153 runs
  • [sig-node] k8s.io/kubernetes/pkg/registry/core/pod.storage 2,153 runs
  • [sig-node] k8s.io/kubernetes/pkg/registry/core/podtemplate.storage 2,153 runs
  • [sig-node] k8s.io/kubernetes/pkg/registry/node.runtimeclass 379 runs
  • [sig-node] k8s.io/kubernetes/pkg/scheduler/framework/plugins.dynamicresources 2,153 runs
  • [sig-node] k8s.io/kubernetes/pkg/security.apparmor 2,153 runs
  • [sig-node] k8s.io/kubernetes/pkg/volume.image 2,153 runs
  • [sig-node] k8s.io/kubernetes/plugin/pkg/admission.nodedeclaredfeatures 2,153 runs
  • [sig-node] k8s.io/kubernetes/plugin/pkg/admission.podresize 2,153 runs
  • [sig-node] k8s.io/kubernetes/test/e2e/common/node/framework.cgroups 2,153 runs
  • [sig-node] k8s.io/kubernetes/test/e2e/common/node/framework.podresize 2,153 runs
  • [sig-node] k8s.io/kubernetes/test/e2e/dra/test-driver.app 158 runs
  • [sig-node] k8s.io/kubernetes/test/e2e/dra/test-driver.gomega 236 runs
  • [sig-release] k8s.io/kubernetes/test/conformance/image.go-runner 2,153 runs
  • [sig-scheduling] k8s.io/component-helpers/scheduling.corev1 2,153 runs
  • [sig-scheduling] k8s.io/component-helpers/scheduling/corev1.nodeaffinity 2,153 runs
  • [sig-scheduling] k8s.io/component-helpers/scheduling/schedulingv1.workloadbuilder 1,875 runs
  • [sig-scheduling] k8s.io/kube-scheduler.framework 2,153 runs
  • [sig-scheduling] k8s.io/kube-scheduler/extender.v1 2,153 runs
  • [sig-scheduling] k8s.io/kubernetes/cmd/kube-scheduler.app 2,153 runs
  • [sig-scheduling] k8s.io/kubernetes/cmd/kube-scheduler/app.options 2,153 runs
  • [sig-scheduling] k8s.io/kubernetes/pkg.scheduler 2,153 runs
  • [sig-scheduling] k8s.io/kubernetes/pkg/apis/scheduling.v1 2,153 runs
  • [sig-scheduling] k8s.io/kubernetes/pkg/apis/scheduling.v1beta1 2,153 runs
  • [sig-scheduling] k8s.io/kubernetes/pkg/apis/scheduling.validation 2,153 runs
  • [sig-scheduling] k8s.io/kubernetes/pkg/controller.devicetainteviction 2,153 runs
  • [sig-scheduling] k8s.io/kubernetes/pkg/controller.tainteviction 2,153 runs
  • [sig-scheduling] k8s.io/kubernetes/pkg/controller/devicetainteviction/config.v1alpha1 2,153 runs
  • [sig-scheduling] k8s.io/kubernetes/pkg/controller/nodelifecycle.scheduler 2,153 runs
  • [sig-scheduling] k8s.io/kubernetes/pkg/registry/scheduling.compositepodgroup 1,976 runs
  • [sig-scheduling] k8s.io/kubernetes/pkg/registry/scheduling.podgroup 2,153 runs
  • [sig-scheduling] k8s.io/kubernetes/pkg/registry/scheduling.priorityclass 2,153 runs
  • [sig-scheduling] k8s.io/kubernetes/pkg/registry/scheduling.workload 2,153 runs
  • [sig-scheduling] k8s.io/kubernetes/pkg/registry/scheduling/podgroup.storage 2,153 runs
  • [sig-scheduling] k8s.io/kubernetes/pkg/registry/scheduling/priorityclass.storage 2,153 runs
  • [sig-scheduling] k8s.io/kubernetes/pkg/registry/scheduling/workload.storage 2,153 runs
  • [sig-scheduling] k8s.io/kubernetes/pkg/scheduler.framework 2,153 runs
  • [sig-scheduling] k8s.io/kubernetes/pkg/scheduler.metrics 2,153 runs
  • [sig-scheduling] k8s.io/kubernetes/pkg/scheduler.profile 2,153 runs
  • [sig-scheduling] k8s.io/kubernetes/pkg/scheduler.util 2,153 runs
  • [sig-scheduling] k8s.io/kubernetes/pkg/scheduler/apis.config 2,153 runs
  • [sig-scheduling] k8s.io/kubernetes/pkg/scheduler/apis/config.scheme 2,153 runs
  • [sig-scheduling] k8s.io/kubernetes/pkg/scheduler/apis/config.v1 2,153 runs
  • [sig-scheduling] k8s.io/kubernetes/pkg/scheduler/apis/config.validation 2,153 runs
  • [sig-scheduling] k8s.io/kubernetes/pkg/scheduler/backend.api_dispatcher 2,153 runs
  • [sig-scheduling] k8s.io/kubernetes/pkg/scheduler/backend.cache 2,153 runs
  • [sig-scheduling] k8s.io/kubernetes/pkg/scheduler/backend.heap 2,153 runs
  • [sig-scheduling] k8s.io/kubernetes/pkg/scheduler/backend.queue 2,153 runs
  • [sig-scheduling] k8s.io/kubernetes/pkg/scheduler/backend/cache.debugger 2,153 runs
  • [sig-scheduling] k8s.io/kubernetes/pkg/scheduler/framework.api_calls 2,153 runs
  • [sig-scheduling] k8s.io/kubernetes/pkg/scheduler/framework.autoscaler_contract 2,153 runs
  • [sig-scheduling] k8s.io/kubernetes/pkg/scheduler/framework.parallelize 2,153 runs
  • [sig-scheduling] k8s.io/kubernetes/pkg/scheduler/framework.runtime 2,153 runs
  • [sig-scheduling] k8s.io/kubernetes/pkg/scheduler/framework/plugins.defaultbinder 2,153 runs
  • [sig-scheduling] k8s.io/kubernetes/pkg/scheduler/framework/plugins.defaultpreemption 2,153 runs
  • [sig-scheduling] k8s.io/kubernetes/pkg/scheduler/framework/plugins.deferredpodscheduling 1,879 runs
  • [sig-scheduling] k8s.io/kubernetes/pkg/scheduler/framework/plugins.gangscheduling 2,153 runs
  • [sig-scheduling] k8s.io/kubernetes/pkg/scheduler/framework/plugins.helper 2,153 runs
  • [sig-scheduling] k8s.io/kubernetes/pkg/scheduler/framework/plugins.imagelocality 2,153 runs
  • [sig-scheduling] k8s.io/kubernetes/pkg/scheduler/framework/plugins.interpodaffinity 2,153 runs
  • [sig-scheduling] k8s.io/kubernetes/pkg/scheduler/framework/plugins.nodeaffinity 2,153 runs
  • [sig-scheduling] k8s.io/kubernetes/pkg/scheduler/framework/plugins.nodedeclaredfeatures 2,153 runs
  • [sig-scheduling] k8s.io/kubernetes/pkg/scheduler/framework/plugins.nodename 2,153 runs
  • [sig-scheduling] k8s.io/kubernetes/pkg/scheduler/framework/plugins.nodeports 2,153 runs
  • [sig-scheduling] k8s.io/kubernetes/pkg/scheduler/framework/plugins.noderesources 2,153 runs
  • [sig-scheduling] k8s.io/kubernetes/pkg/scheduler/framework/plugins.nodeunschedulable 2,153 runs
  • [sig-scheduling] k8s.io/kubernetes/pkg/scheduler/framework/plugins.podgrouppodscount 2,153 runs
  • [sig-scheduling] k8s.io/kubernetes/pkg/scheduler/framework/plugins.podtopologyspread 2,153 runs
  • [sig-scheduling] k8s.io/kubernetes/pkg/scheduler/framework/plugins.queuesort 2,153 runs
  • [sig-scheduling] k8s.io/kubernetes/pkg/scheduler/framework/plugins.schedulinggates 2,153 runs
  • [sig-scheduling] k8s.io/kubernetes/pkg/scheduler/framework/plugins.tainttoleration 2,153 runs
  • [sig-scheduling] k8s.io/kubernetes/pkg/scheduler/framework/plugins.topologyaware 2,153 runs
  • [sig-scheduling] k8s.io/kubernetes/pkg/scheduler/metrics.resources 2,153 runs
  • [sig-scheduling] k8s.io/kubernetes/pkg/scheduler/util.assumecache 2,153 runs
  • [sig-storage] k8s.io.csi-translation-lib 2,153 runs
  • [sig-storage] k8s.io.mount-utils 2,153 runs
  • [sig-storage] k8s.io/component-helpers/storage.ephemeral 2,153 runs
  • [sig-storage] k8s.io/component-helpers/storage.volume 2,153 runs
  • [sig-storage] k8s.io/component-helpers/storage/volume.assumecache 727 runs
  • [sig-storage] k8s.io/csi-translation-lib.plugins 2,153 runs
  • [sig-storage] k8s.io/kubernetes/pkg.volume 2,153 runs
  • [sig-storage] k8s.io/kubernetes/pkg/apis/storage.v1 2,153 runs
  • [sig-storage] k8s.io/kubernetes/pkg/apis/storage.v1beta1 2,153 runs
  • [sig-storage] k8s.io/kubernetes/pkg/apis/storage.validation 2,153 runs
  • [sig-storage] k8s.io/kubernetes/pkg/controller/volume.attachdetach 2,153 runs
  • [sig-storage] k8s.io/kubernetes/pkg/controller/volume.ephemeral 2,153 runs
  • [sig-storage] k8s.io/kubernetes/pkg/controller/volume.expand 2,153 runs
  • [sig-storage] k8s.io/kubernetes/pkg/controller/volume.persistentvolume 2,153 runs
  • [sig-storage] k8s.io/kubernetes/pkg/controller/volume.pvcprotection 2,153 runs
  • [sig-storage] k8s.io/kubernetes/pkg/controller/volume.pvprotection 2,153 runs
  • [sig-storage] k8s.io/kubernetes/pkg/controller/volume.selinuxwarning 2,153 runs
  • [sig-storage] k8s.io/kubernetes/pkg/controller/volume.vacprotection 2,153 runs
  • [sig-storage] k8s.io/kubernetes/pkg/controller/volume/attachdetach.cache 2,153 runs
  • [sig-storage] k8s.io/kubernetes/pkg/controller/volume/attachdetach.metrics 2,153 runs
  • [sig-storage] k8s.io/kubernetes/pkg/controller/volume/attachdetach.populator 2,153 runs
  • [sig-storage] k8s.io/kubernetes/pkg/controller/volume/attachdetach.statusupdater 2,153 runs
  • [sig-storage] k8s.io/kubernetes/pkg/controller/volume/attachdetach.util 2,153 runs
  • [sig-storage] k8s.io/kubernetes/pkg/controller/volume/persistentvolume.metrics 2,153 runs
  • [sig-storage] k8s.io/kubernetes/pkg/controller/volume/selinuxwarning.cache 2,153 runs
  • [sig-storage] k8s.io/kubernetes/pkg/controller/volume/selinuxwarning.translator 2,153 runs
  • [sig-storage] k8s.io/kubernetes/pkg/controller/volume/selinuxwarning/internal.parse 2,153 runs
  • [sig-storage] k8s.io/kubernetes/pkg/registry/core.persistentvolume 2,153 runs
  • [sig-storage] k8s.io/kubernetes/pkg/registry/core.persistentvolumeclaim 2,153 runs
  • [sig-storage] k8s.io/kubernetes/pkg/registry/core/persistentvolumeclaim.storage 2,153 runs
  • [sig-storage] k8s.io/kubernetes/pkg/registry/storage.csidriver 2,153 runs
  • [sig-storage] k8s.io/kubernetes/pkg/registry/storage.csinode 2,153 runs
  • [sig-storage] k8s.io/kubernetes/pkg/registry/storage.csistoragecapacity 2,153 runs
  • [sig-storage] k8s.io/kubernetes/pkg/registry/storage.storageclass 2,153 runs
  • [sig-storage] k8s.io/kubernetes/pkg/registry/storage.volumeattachment 2,153 runs
  • [sig-storage] k8s.io/kubernetes/pkg/registry/storage.volumeattributesclass 2,153 runs
  • [sig-storage] k8s.io/kubernetes/pkg/registry/storage/csidriver.storage 2,153 runs
  • [sig-storage] k8s.io/kubernetes/pkg/registry/storage/csinode.storage 2,153 runs
  • [sig-storage] k8s.io/kubernetes/pkg/registry/storage/csistoragecapacity.storage 2,153 runs
  • [sig-storage] k8s.io/kubernetes/pkg/registry/storage/storageclass.storage 2,153 runs
  • [sig-storage] k8s.io/kubernetes/pkg/registry/storage/volumeattachment.storage 2,153 runs
  • [sig-storage] k8s.io/kubernetes/pkg/registry/storage/volumeattributesclass.storage 2,153 runs
  • [sig-storage] k8s.io/kubernetes/pkg/scheduler/framework/plugins.nodevolumelimits 2,153 runs
  • [sig-storage] k8s.io/kubernetes/pkg/scheduler/framework/plugins.volumerestrictions 2,153 runs
  • [sig-storage] k8s.io/kubernetes/pkg/scheduler/framework/plugins.volumezone 2,153 runs
  • [sig-storage] k8s.io/kubernetes/pkg/util.removeall 2,153 runs
  • [sig-storage] k8s.io/kubernetes/pkg/volume.configmap 2,153 runs
  • [sig-storage] k8s.io/kubernetes/pkg/volume.csi 2,153 runs
  • [sig-storage] k8s.io/kubernetes/pkg/volume.downwardapi 2,153 runs
  • [sig-storage] k8s.io/kubernetes/pkg/volume.emptydir 2,153 runs
  • [sig-storage] k8s.io/kubernetes/pkg/volume.fc 2,153 runs
  • [sig-storage] k8s.io/kubernetes/pkg/volume.flexvolume 2,153 runs
  • [sig-storage] k8s.io/kubernetes/pkg/volume.git_repo 2,153 runs
  • [sig-storage] k8s.io/kubernetes/pkg/volume.hostpath 2,153 runs
  • [sig-storage] k8s.io/kubernetes/pkg/volume.iscsi 2,153 runs
  • [sig-storage] k8s.io/kubernetes/pkg/volume.local 2,153 runs
  • [sig-storage] k8s.io/kubernetes/pkg/volume.nfs 2,153 runs
  • [sig-storage] k8s.io/kubernetes/pkg/volume.projected 2,153 runs
  • [sig-storage] k8s.io/kubernetes/pkg/volume.secret 2,153 runs
  • [sig-storage] k8s.io/kubernetes/pkg/volume.util 2,153 runs
  • [sig-storage] k8s.io/kubernetes/pkg/volume.validation 2,153 runs
  • [sig-storage] k8s.io/kubernetes/pkg/volume/csi.nodeinfomanager 2,153 runs
  • [sig-storage] k8s.io/kubernetes/pkg/volume/util.fsquota 2,153 runs
  • [sig-storage] k8s.io/kubernetes/pkg/volume/util.hostutil 2,153 runs
  • [sig-storage] k8s.io/kubernetes/pkg/volume/util.nestedpendingoperations 2,153 runs
  • [sig-storage] k8s.io/kubernetes/pkg/volume/util.operationexecutor 2,153 runs
  • [sig-storage] k8s.io/kubernetes/pkg/volume/util.recyclerclient 2,153 runs
  • [sig-storage] k8s.io/kubernetes/pkg/volume/util.subpath 2,153 runs
  • [sig-storage] k8s.io/kubernetes/pkg/volume/util.types 2,153 runs
  • [sig-storage] k8s.io/kubernetes/pkg/volume/util.volumepathhandler 2,153 runs
  • [sig-storage] k8s.io/kubernetes/test/e2e/storage.external 2,153 runs
  • [sig-storage] k8s.io/kubernetes/test/e2e/storage.utils 2,153 runs
  • [sig-testing] k8s.io.ktesting 15 runs
  • [sig-testing] k8s.io/client-go.ktesting 15 runs
  • [sig-testing] k8s.io/ktesting.format 15 runs
  • [sig-testing] k8s.io/ktesting/internal.synctestinit 15 runs
  • [sig-testing] k8s.io/kubernetes/cmd.gotemplate 2,153 runs
  • [sig-testing] k8s.io/kubernetes/cmd.prune-junit-xml 2,153 runs
  • [sig-testing] k8s.io/kubernetes/cmd/prune-junit-xml.logparse 2,153 runs
  • [sig-testing] k8s.io/kubernetes/test.list 2,153 runs
  • [sig-testing] k8s.io/kubernetes/test.typecheck 2,153 runs
  • [sig-testing] k8s.io/kubernetes/test.utils 348 runs
  • [sig-testing] k8s.io/kubernetes/test/declarative_validation/admissionregistration.mutatingadmissionpolicy 2,153 runs
  • [sig-testing] k8s.io/kubernetes/test/declarative_validation/admissionregistration.mutatingadmissionpolicybinding 2,153 runs
  • [sig-testing] k8s.io/kubernetes/test/declarative_validation/admissionregistration.mutatingwebhookconfiguration 2,153 runs
  • [sig-testing] k8s.io/kubernetes/test/declarative_validation/admissionregistration.validatingadmissionpolicy 2,153 runs
  • [sig-testing] k8s.io/kubernetes/test/declarative_validation/admissionregistration.validatingadmissionpolicybinding 2,153 runs
  • [sig-testing] k8s.io/kubernetes/test/declarative_validation/admissionregistration.validatingwebhookconfiguration 2,153 runs
  • [sig-testing] k8s.io/kubernetes/test/declarative_validation/apps.controllerrevision 2,153 runs
  • [sig-testing] k8s.io/kubernetes/test/declarative_validation/apps.daemonset 2,153 runs
  • [sig-testing] k8s.io/kubernetes/test/declarative_validation/apps.deployment 2,153 runs
  • [sig-testing] k8s.io/kubernetes/test/declarative_validation/apps.replicaset 2,153 runs
  • [sig-testing] k8s.io/kubernetes/test/declarative_validation/apps.scale 2,153 runs
  • [sig-testing] k8s.io/kubernetes/test/declarative_validation/apps.statefulset 2,153 runs
  • [sig-testing] k8s.io/kubernetes/test/declarative_validation/authorization.localsubjectaccessreview 2,153 runs
  • [sig-testing] k8s.io/kubernetes/test/declarative_validation/authorization.selfsubjectaccessreview 2,153 runs
  • [sig-testing] k8s.io/kubernetes/test/declarative_validation/authorization.subjectaccessreview 2,153 runs
  • [sig-testing] k8s.io/kubernetes/test/declarative_validation/autoscaling.horizontalpodautoscaler 2,153 runs
  • [sig-testing] k8s.io/kubernetes/test/declarative_validation/autoscaling.scale 2,153 runs
  • [sig-testing] k8s.io/kubernetes/test/declarative_validation/batch.cronjob 2,153 runs
  • [sig-testing] k8s.io/kubernetes/test/declarative_validation/batch.job 2,153 runs
  • [sig-testing] k8s.io/kubernetes/test/declarative_validation/certificates.certificatesigningrequest 2,153 runs
  • [sig-testing] k8s.io/kubernetes/test/declarative_validation/certificates.clustertrustbundle 2,153 runs
  • [sig-testing] k8s.io/kubernetes/test/declarative_validation/certificates.podcertificaterequest 2,153 runs
  • [sig-testing] k8s.io/kubernetes/test/declarative_validation/coordination.lease 2,153 runs
  • [sig-testing] k8s.io/kubernetes/test/declarative_validation/coordination.leasecandidate 2,153 runs
  • [sig-testing] k8s.io/kubernetes/test/declarative_validation/core.configmap 2,153 runs
  • [sig-testing] k8s.io/kubernetes/test/declarative_validation/core.endpoints 2,153 runs
  • [sig-testing] k8s.io/kubernetes/test/declarative_validation/core.event 2,153 runs
  • [sig-testing] k8s.io/kubernetes/test/declarative_validation/core.limitrange 2,153 runs
  • [sig-testing] k8s.io/kubernetes/test/declarative_validation/core.namespace 2,153 runs
  • [sig-testing] k8s.io/kubernetes/test/declarative_validation/core.node 2,153 runs
  • [sig-testing] k8s.io/kubernetes/test/declarative_validation/core.persistentvolume 2,153 runs
  • [sig-testing] k8s.io/kubernetes/test/declarative_validation/core.persistentvolumeclaim 2,153 runs
  • [sig-testing] k8s.io/kubernetes/test/declarative_validation/core.pod 2,153 runs
  • [sig-testing] k8s.io/kubernetes/test/declarative_validation/core.podtemplate 2,153 runs
  • [sig-testing] k8s.io/kubernetes/test/declarative_validation/core.replicationcontroller 2,153 runs
  • [sig-testing] k8s.io/kubernetes/test/declarative_validation/core.resourcequota 2,153 runs
  • [sig-testing] k8s.io/kubernetes/test/declarative_validation/core.secret 2,153 runs
  • [sig-testing] k8s.io/kubernetes/test/declarative_validation/core.service 2,153 runs
  • [sig-testing] k8s.io/kubernetes/test/declarative_validation/core.serviceaccount 2,153 runs
  • [sig-testing] k8s.io/kubernetes/test/declarative_validation/discovery.endpointslice 2,153 runs
  • [sig-testing] k8s.io/kubernetes/test/declarative_validation/events.event 2,153 runs
  • [sig-testing] k8s.io/kubernetes/test/declarative_validation/flowcontrol.flowschema 2,153 runs
  • [sig-testing] k8s.io/kubernetes/test/declarative_validation/flowcontrol.prioritylevelconfiguration 2,153 runs
  • [sig-testing] k8s.io/kubernetes/test/declarative_validation/internal.storageversion 2,153 runs
  • [sig-testing] k8s.io/kubernetes/test/declarative_validation/lifecycle.eviction 1,823 runs
  • [sig-testing] k8s.io/kubernetes/test/declarative_validation/lifecycle.evictionrequest 1,823 runs
  • [sig-testing] k8s.io/kubernetes/test/declarative_validation/networking.ingress 2,153 runs
  • [sig-testing] k8s.io/kubernetes/test/declarative_validation/networking.ingressclass 2,153 runs
  • [sig-testing] k8s.io/kubernetes/test/declarative_validation/networking.ipaddress 2,153 runs
  • [sig-testing] k8s.io/kubernetes/test/declarative_validation/networking.networkpolicy 2,153 runs
  • [sig-testing] k8s.io/kubernetes/test/declarative_validation/networking.servicecidr 2,153 runs
  • [sig-testing] k8s.io/kubernetes/test/declarative_validation/node.runtimeclass 2,153 runs
  • [sig-testing] k8s.io/kubernetes/test/declarative_validation/policy.poddisruptionbudget 2,153 runs
  • [sig-testing] k8s.io/kubernetes/test/declarative_validation/rbac.clusterrole 2,153 runs
  • [sig-testing] k8s.io/kubernetes/test/declarative_validation/rbac.clusterrolebinding 2,153 runs
  • [sig-testing] k8s.io/kubernetes/test/declarative_validation/rbac.role 2,153 runs
  • [sig-testing] k8s.io/kubernetes/test/declarative_validation/rbac.rolebinding 2,153 runs
  • [sig-testing] k8s.io/kubernetes/test/declarative_validation/resource.deviceclass 2,153 runs
  • [sig-testing] k8s.io/kubernetes/test/declarative_validation/resource.devicetaintrule 2,153 runs
  • [sig-testing] k8s.io/kubernetes/test/declarative_validation/resource.resourceclaim 2,153 runs
  • [sig-testing] k8s.io/kubernetes/test/declarative_validation/resource.resourceclaimtemplate 2,153 runs
  • [sig-testing] k8s.io/kubernetes/test/declarative_validation/resource.resourcepoolstatusrequest 2,153 runs
  • [sig-testing] k8s.io/kubernetes/test/declarative_validation/resource.resourceslice 2,153 runs
  • [sig-testing] k8s.io/kubernetes/test/declarative_validation/scheduling.compositepodgroup 1,976 runs
  • [sig-testing] k8s.io/kubernetes/test/declarative_validation/scheduling.podgroup 2,153 runs
  • [sig-testing] k8s.io/kubernetes/test/declarative_validation/scheduling.priorityclass 2,153 runs
  • [sig-testing] k8s.io/kubernetes/test/declarative_validation/scheduling.workload 2,153 runs
  • [sig-testing] k8s.io/kubernetes/test/declarative_validation/storage.csidriver 2,153 runs
  • [sig-testing] k8s.io/kubernetes/test/declarative_validation/storage.csinode 2,153 runs
  • [sig-testing] k8s.io/kubernetes/test/declarative_validation/storage.csistoragecapacity 2,153 runs
  • [sig-testing] k8s.io/kubernetes/test/declarative_validation/storage.storageclass 2,153 runs
  • [sig-testing] k8s.io/kubernetes/test/declarative_validation/storage.volumeattachment 2,153 runs
  • [sig-testing] k8s.io/kubernetes/test/declarative_validation/storage.volumeattributesclass 2,153 runs
  • [sig-testing] k8s.io/kubernetes/test/declarative_validation/storagemigration.storageversionmigration 2,153 runs
  • [sig-testing] k8s.io/kubernetes/test/e2e.chaosmonkey 2,153 runs
  • [sig-testing] k8s.io/kubernetes/test/e2e.framework 2,153 runs
  • [sig-testing] k8s.io/kubernetes/test/e2e/common.apimachinery 2,153 runs
  • [sig-testing] k8s.io/kubernetes/test/e2e/framework.config 2,153 runs
  • [sig-testing] k8s.io/kubernetes/test/e2e/framework.conformance 2,153 runs
  • [sig-testing] k8s.io/kubernetes/test/e2e/framework.node 2,153 runs
  • [sig-testing] k8s.io/kubernetes/test/e2e/framework.pod 2,153 runs
  • [sig-testing] k8s.io/kubernetes/test/e2e/framework.skipper 2,153 runs
  • [sig-testing] k8s.io/kubernetes/test/e2e/framework.testfiles 2,153 runs
  • [sig-testing] k8s.io/kubernetes/test/e2e/framework.timer 2,153 runs
  • [sig-testing] k8s.io/kubernetes/test/e2e/framework.websocket 367 runs
  • [sig-testing] k8s.io/kubernetes/test/e2e/framework/internal.unittests 2,153 runs
  • [sig-testing] k8s.io/kubernetes/test/e2e/framework/internal/unittests.bugs 2,153 runs
  • [sig-testing] k8s.io/kubernetes/test/e2e/framework/internal/unittests.cleanup 2,153 runs
  • [sig-testing] k8s.io/kubernetes/test/e2e/framework/internal/unittests.list-labels 2,153 runs
  • [sig-testing] k8s.io/kubernetes/test/e2e/framework/internal/unittests.list-tests 2,153 runs
  • [sig-testing] k8s.io/kubernetes/test/e2e/framework/internal/unittests.withprovider 1,874 runs
  • [sig-testing] k8s.io/kubernetes/test/e2e/invariants.logcheck 2,153 runs
  • [sig-testing] k8s.io/kubernetes/test/e2e/invariants.metrics 2,153 runs
  • [sig-testing] k8s.io/kubernetes/test/fuzz.cbor 2,153 runs
  • [sig-testing] k8s.io/kubernetes/test/images.regression-issue-74839 2,153 runs
  • [sig-testing] k8s.io/kubernetes/test/images/agnhost.fakeregistryserver 2,153 runs
  • [sig-testing] k8s.io/kubernetes/test/images/agnhost.mounttest 2,153 runs
  • [sig-testing] k8s.io/kubernetes/test/images/agnhost.webhook 2,153 runs
  • [sig-testing] k8s.io/kubernetes/test/images/agnhost/crd-conversion-webhook.converter 2,153 runs
  • [sig-testing] k8s.io/kubernetes/test/utils.format 2,153 runs
  • [sig-testing] k8s.io/kubernetes/test/utils.image 2,153 runs
  • [sig-testing] k8s.io/kubernetes/test/utils.localupcluster 2,153 runs
  • [sig-testing] k8s.io/kubernetes/test/utils/client-go.ktesting 2,138 runs
  • [sig-testing] k8s.io/kubernetes/test/utils/ktesting.format 2,138 runs
  • [sig-testing] k8s.io/kubernetes/test/utils/ktesting/internal.synctestinit 2,138 runs
  • go.etcd.io/etcd/client/pkg/v3.fileutil 2,153 runs
  • k8s.io.api 2,153 runs
  • k8s.io/api/core.v1 2,153 runs
  • k8s.io/api/extensions.v1beta1 2,153 runs
  • k8s.io/api/networking.v1 2,153 runs
  • k8s.io/api/resource.v1 1,876 runs
  • k8s.io/cri-api/pkg.errors 2,153 runs
  • k8s.io/cri-api/pkg/apis/runtime.v1 2,153 runs
  • k8s.io/cri-client.pkg 2,153 runs
  • k8s.io/cri-client/pkg.logs 2,153 runs
  • k8s.io/cri-client/pkg.util 2,153 runs
  • k8s.io/kubelet/config.v1 2,153 runs
  • k8s.io/kubelet/config.v1beta1 2,153 runs
  • k8s.io/kubelet/pkg.types 2,153 runs
  • k8s.io/kubernetes/cmd.genkubedocs 2,153 runs
  • k8s.io/kubernetes/cmd.genutils 2,153 runs
  • k8s.io/kubernetes/cmd.import-boss 2,153 runs
  • k8s.io/kubernetes/cmd/kubemark.app 2,123 runs
  • k8s.io/kubernetes/hack.apidiff-changelog 2,153 runs
  • k8s.io/kubernetes/hack/tools.instrumentation 2,153 runs
  • k8s.io/kubernetes/hack/tools/golangci-lint/sorted.pkg 2,153 runs
  • k8s.io/kubernetes/pkg.capabilities 2,153 runs
  • k8s.io/kubernetes/pkg.features 2,153 runs
  • k8s.io/kubernetes/pkg.fieldpath 2,153 runs
  • k8s.io/kubernetes/pkg.printers 2,153 runs
  • k8s.io/kubernetes/pkg.routes 2,153 runs
  • k8s.io/kubernetes/pkg/admission/plugin/policy/manifest.loader 2,153 runs
  • k8s.io/kubernetes/pkg/admission/plugin/webhook/manifest.loader 2,153 runs
  • k8s.io/kubernetes/pkg/api.job 2,153 runs
  • k8s.io/kubernetes/pkg/api.node 2,153 runs
  • k8s.io/kubernetes/pkg/api.persistentvolume 2,153 runs
  • k8s.io/kubernetes/pkg/api.persistentvolumeclaim 2,153 runs
  • k8s.io/kubernetes/pkg/api.pod 2,153 runs
  • k8s.io/kubernetes/pkg/api.resourceclaimspec 2,153 runs
  • k8s.io/kubernetes/pkg/api.service 2,153 runs
  • k8s.io/kubernetes/pkg/api.servicecidr 2,153 runs
  • k8s.io/kubernetes/pkg/api.storage 2,153 runs
  • k8s.io/kubernetes/pkg/api.testing 2,153 runs
  • k8s.io/kubernetes/pkg/api/v1.endpoints 2,153 runs
  • k8s.io/kubernetes/pkg/api/v1.persistentvolume 2,153 runs
  • k8s.io/kubernetes/pkg/api/v1.pod 2,153 runs
  • k8s.io/kubernetes/pkg/api/v1.resource 2,153 runs
  • k8s.io/kubernetes/pkg/api/v1.service 2,153 runs
  • k8s.io/kubernetes/pkg/apis/admissionregistration.v1 2,153 runs
  • k8s.io/kubernetes/pkg/apis/admissionregistration.v1alpha1 2,153 runs
  • k8s.io/kubernetes/pkg/apis/admissionregistration.v1beta1 2,153 runs
  • k8s.io/kubernetes/pkg/apis/admissionregistration.validation 2,153 runs
  • k8s.io/kubernetes/pkg/apis/apiserverinternal.install 2,153 runs
  • k8s.io/kubernetes/pkg/apis/apiserverinternal.validation 2,153 runs
  • k8s.io/kubernetes/pkg/apis/autoscaling.v1 2,153 runs
  • k8s.io/kubernetes/pkg/apis/autoscaling.v2 2,153 runs
  • k8s.io/kubernetes/pkg/apis/autoscaling.validation 2,153 runs
  • k8s.io/kubernetes/pkg/apis/coordination.validation 2,153 runs
  • k8s.io/kubernetes/pkg/apis/discovery.v1 2,153 runs
  • k8s.io/kubernetes/pkg/apis/discovery.v1beta1 2,153 runs
  • k8s.io/kubernetes/pkg/apis/discovery.validation 2,153 runs
  • k8s.io/kubernetes/pkg/apis/flowcontrol.internalbootstrap 2,153 runs
  • k8s.io/kubernetes/pkg/apis/flowcontrol.v1 2,153 runs
  • k8s.io/kubernetes/pkg/apis/flowcontrol.v1beta1 2,153 runs
  • k8s.io/kubernetes/pkg/apis/flowcontrol.v1beta2 2,153 runs
  • k8s.io/kubernetes/pkg/apis/flowcontrol.v1beta3 2,153 runs
  • k8s.io/kubernetes/pkg/apis/flowcontrol.validation 2,153 runs
  • k8s.io/kubernetes/pkg/apis/lifecycle.validation 1,823 runs
  • k8s.io/kubernetes/pkg/apis/node.v1alpha1 2,153 runs
  • k8s.io/kubernetes/pkg/apis/node.validation 2,153 runs
  • k8s.io/kubernetes/pkg/apis/resource.install 2,153 runs
  • k8s.io/kubernetes/pkg/apis/resource.v1 2,153 runs
  • k8s.io/kubernetes/pkg/apis/resource.v1alpha3 2,153 runs
  • k8s.io/kubernetes/pkg/apis/resource.v1beta1 2,153 runs
  • k8s.io/kubernetes/pkg/apis/resource.v1beta2 2,153 runs
  • k8s.io/kubernetes/pkg/apis/resource.validation 2,153 runs
  • k8s.io/kubernetes/pkg/apis/storagemigration.validation 2,153 runs
  • k8s.io/kubernetes/pkg/client.conditions 2,153 runs
  • k8s.io/kubernetes/pkg/client.tests 2,153 runs
  • k8s.io/kubernetes/pkg/cluster.ports 298 runs
  • k8s.io/kubernetes/pkg/generated.openapi 2,153 runs
  • k8s.io/kubernetes/pkg/printers.internalversion 2,153 runs
  • k8s.io/kubernetes/pkg/registry.resource 2,153 runs
  • k8s.io/kubernetes/pkg/registry/admissionregistration.mutatingadmissionpolicy 2,153 runs
  • k8s.io/kubernetes/pkg/registry/admissionregistration.mutatingadmissionpolicybinding 2,153 runs
  • k8s.io/kubernetes/pkg/registry/admissionregistration.mutatingwebhookconfiguration 2,153 runs
  • k8s.io/kubernetes/pkg/registry/admissionregistration.validatingadmissionpolicy 2,153 runs
  • k8s.io/kubernetes/pkg/registry/admissionregistration.validatingadmissionpolicybinding 2,153 runs
  • k8s.io/kubernetes/pkg/registry/admissionregistration.validatingwebhookconfiguration 2,153 runs
  • k8s.io/kubernetes/pkg/registry/admissionregistration/mutatingadmissionpolicy.storage 2,153 runs
  • k8s.io/kubernetes/pkg/registry/admissionregistration/mutatingadmissionpolicybinding.storage 2,153 runs
  • k8s.io/kubernetes/pkg/registry/admissionregistration/validatingadmissionpolicy.storage 2,153 runs
  • k8s.io/kubernetes/pkg/registry/admissionregistration/validatingadmissionpolicybinding.storage 2,153 runs
  • k8s.io/kubernetes/pkg/registry/admissionregistration/validatingwebhookconfiguration.storage 2,153 runs
  • k8s.io/kubernetes/pkg/registry/apiserverinternal.storageversion 2,153 runs
  • k8s.io/kubernetes/pkg/registry/apiserverinternal/storageversion.storage 2,153 runs
  • k8s.io/kubernetes/pkg/registry/autoscaling.horizontalpodautoscaler 2,153 runs
  • k8s.io/kubernetes/pkg/registry/autoscaling/horizontalpodautoscaler.storage 2,153 runs
  • k8s.io/kubernetes/pkg/registry/core.componentstatus 2,153 runs
  • k8s.io/kubernetes/pkg/registry/core.configmap 2,153 runs
  • k8s.io/kubernetes/pkg/registry/core.endpoint 2,153 runs
  • k8s.io/kubernetes/pkg/registry/core.event 2,153 runs
  • k8s.io/kubernetes/pkg/registry/core.namespace 2,153 runs
  • k8s.io/kubernetes/pkg/registry/core.resourcequota 2,153 runs
  • k8s.io/kubernetes/pkg/registry/core.rest 2,153 runs
  • k8s.io/kubernetes/pkg/registry/core.secret 2,153 runs
  • k8s.io/kubernetes/pkg/registry/core.service 2,153 runs
  • k8s.io/kubernetes/pkg/registry/core/configmap.storage 2,153 runs
  • k8s.io/kubernetes/pkg/registry/core/endpoint.storage 2,153 runs
  • k8s.io/kubernetes/pkg/registry/core/event.storage 2,153 runs
  • k8s.io/kubernetes/pkg/registry/core/limitrange.storage 2,153 runs
  • k8s.io/kubernetes/pkg/registry/core/namespace.storage 2,153 runs
  • k8s.io/kubernetes/pkg/registry/core/resourcequota.storage 2,153 runs
  • k8s.io/kubernetes/pkg/registry/core/service.allocator 2,153 runs
  • k8s.io/kubernetes/pkg/registry/core/service.ipallocator 2,153 runs
  • k8s.io/kubernetes/pkg/registry/core/service.portallocator 2,153 runs
  • k8s.io/kubernetes/pkg/registry/core/service.storage 2,153 runs
  • k8s.io/kubernetes/pkg/registry/core/service/allocator.storage 2,153 runs
  • k8s.io/kubernetes/pkg/registry/core/service/ipallocator.controller 2,153 runs
  • k8s.io/kubernetes/pkg/registry/core/service/ipallocator.storage 2,153 runs
  • k8s.io/kubernetes/pkg/registry/core/service/portallocator.controller 2,153 runs
  • k8s.io/kubernetes/pkg/registry/core/service/portallocator.storage 2,153 runs
  • k8s.io/kubernetes/pkg/registry/discovery.endpointslice 2,153 runs
  • k8s.io/kubernetes/pkg/registry/flowcontrol.ensurer 2,153 runs
  • k8s.io/kubernetes/pkg/registry/flowcontrol.prioritylevelconfiguration 2,153 runs
  • k8s.io/kubernetes/pkg/registry/flowcontrol.rest 2,153 runs
  • k8s.io/kubernetes/pkg/registry/lifecycle.eviction 1,823 runs
  • k8s.io/kubernetes/pkg/registry/lifecycle.evictionrequest 1,823 runs
  • k8s.io/kubernetes/pkg/registry/lifecycle/eviction.storage 1,823 runs
  • k8s.io/kubernetes/pkg/registry/lifecycle/evictionrequest.storage 1,823 runs
  • k8s.io/kubernetes/pkg/registry/networking.ingress 2,153 runs
  • k8s.io/kubernetes/pkg/registry/networking.ingressclass 2,153 runs
  • k8s.io/kubernetes/pkg/registry/networking.ipaddress 2,153 runs
  • k8s.io/kubernetes/pkg/registry/networking.networkpolicy 2,153 runs
  • k8s.io/kubernetes/pkg/registry/networking.servicecidr 2,153 runs
  • k8s.io/kubernetes/pkg/registry/networking/ingress.storage 2,153 runs
  • k8s.io/kubernetes/pkg/registry/networking/networkpolicy.storage 2,153 runs
  • k8s.io/kubernetes/pkg/registry/resource.deviceclass 2,153 runs
  • k8s.io/kubernetes/pkg/registry/resource.devicetaintrule 2,153 runs
  • k8s.io/kubernetes/pkg/registry/resource.resourceclaim 2,153 runs
  • k8s.io/kubernetes/pkg/registry/resource.resourceclaimtemplate 2,153 runs
  • k8s.io/kubernetes/pkg/registry/resource.resourcepoolstatusrequest 1,833 runs
  • k8s.io/kubernetes/pkg/registry/resource.resourceslice 2,153 runs
  • k8s.io/kubernetes/pkg/registry/resource/deviceclass.storage 2,153 runs
  • k8s.io/kubernetes/pkg/registry/resource/devicetaintrule.storage 2,153 runs
  • k8s.io/kubernetes/pkg/registry/resource/resourceclaim.storage 2,153 runs
  • k8s.io/kubernetes/pkg/registry/resource/resourceclaimtemplate.storage 2,153 runs
  • k8s.io/kubernetes/pkg/registry/resource/resourceslice.storage 2,153 runs
  • k8s.io/kubernetes/pkg/util.async 2,153 runs
  • k8s.io/kubernetes/pkg/util.env 2,153 runs
  • k8s.io/kubernetes/pkg/util.filesystem 2,153 runs
  • k8s.io/kubernetes/pkg/util.flag 2,153 runs
  • k8s.io/kubernetes/pkg/util.goroutinemap 2,153 runs
  • k8s.io/kubernetes/pkg/util.hash 2,153 runs
  • k8s.io/kubernetes/pkg/util.kernel 2,153 runs
  • k8s.io/kubernetes/pkg/util.labels 2,153 runs
  • k8s.io/kubernetes/pkg/util.node 2,153 runs
  • k8s.io/kubernetes/pkg/util.oom 1,854 runs
  • k8s.io/kubernetes/pkg/util.parsers 2,153 runs
  • k8s.io/kubernetes/pkg/util.pod 2,153 runs
  • k8s.io/kubernetes/pkg/util.procfs 2,153 runs
  • k8s.io/kubernetes/pkg/util.slice 2,153 runs
  • k8s.io/kubernetes/pkg/util.tail 2,153 runs
  • k8s.io/kubernetes/pkg/util.taints 2,153 runs
  • k8s.io/kubernetes/pkg/util.tolerations 2,153 runs
  • k8s.io/kubernetes/plugin/pkg/admission.admit 2,153 runs
  • k8s.io/kubernetes/plugin/pkg/admission.alwayspullimages 2,153 runs
  • k8s.io/kubernetes/plugin/pkg/admission.antiaffinity 2,153 runs
  • k8s.io/kubernetes/plugin/pkg/admission.defaulttolerationseconds 2,153 runs
  • k8s.io/kubernetes/plugin/pkg/admission.deny 2,153 runs
  • k8s.io/kubernetes/plugin/pkg/admission.eventratelimit 2,153 runs
  • k8s.io/kubernetes/plugin/pkg/admission.extendedresourcetoleration 2,153 runs
  • k8s.io/kubernetes/plugin/pkg/admission.gc 2,153 runs
  • k8s.io/kubernetes/plugin/pkg/admission.job 278 runs
  • k8s.io/kubernetes/plugin/pkg/admission.limitranger 2,153 runs
  • k8s.io/kubernetes/plugin/pkg/admission.nodetaint 2,153 runs
  • k8s.io/kubernetes/plugin/pkg/admission.podnodeselector 2,153 runs
  • k8s.io/kubernetes/plugin/pkg/admission.podtolerationrestriction 2,153 runs
  • k8s.io/kubernetes/plugin/pkg/admission.podtopologylabels 2,153 runs
  • k8s.io/kubernetes/plugin/pkg/admission.priority 2,153 runs
  • k8s.io/kubernetes/plugin/pkg/admission.resourcequota 2,153 runs
  • k8s.io/kubernetes/plugin/pkg/admission.runtimeclass 2,153 runs
  • k8s.io/kubernetes/plugin/pkg/admission/eventratelimit/apis/eventratelimit.validation 2,153 runs
  • k8s.io/kubernetes/plugin/pkg/admission/namespace.autoprovision 2,153 runs
  • k8s.io/kubernetes/plugin/pkg/admission/namespace.exists 2,153 runs
  • k8s.io/kubernetes/plugin/pkg/admission/network.defaultingressclass 2,153 runs
  • k8s.io/kubernetes/plugin/pkg/admission/network.denyserviceexternalips 2,153 runs
  • k8s.io/kubernetes/plugin/pkg/admission/podtolerationrestriction/apis/podtolerationrestriction.validation 2,153 runs
  • k8s.io/kubernetes/plugin/pkg/admission/scheduling.podgroupprotection 2,153 runs
  • k8s.io/kubernetes/plugin/pkg/admission/security.podsecurity 2,153 runs
  • k8s.io/kubernetes/plugin/pkg/admission/storage.storageobjectinuseprotection 2,153 runs
  • k8s.io/kubernetes/plugin/pkg/admission/storage/persistentvolume.resize 2,153 runs
  • k8s.io/kubernetes/plugin/pkg/admission/storage/storageclass.setdefault 2,153 runs
  • sigs.k8s.io/logtools.logcheck 2,153 runs
  • sigs.k8s.io/logtools/logcheck.gclplugin 2,153 runs
  • sigs.k8s.io/logtools/logcheck.pkg 2,153 runs
  • sigs.k8s.io/logtools/logcheck.plugin 2,153 runs
pass fail error passed on retry skip A gap in the rail is a run without this test. Rates use the final outcome of each run; retry attempts do not increase the sample size. Rows sorted broken → new → flaky → quiet → insufficient data → healthy, then by score. Left to right is oldest to newest run. Click a row for its failures. Hover a mark for the run.