flakemap — inspection report

Test reliability across CI history, computed from JUnit, NUnit XML and TRX.

runs 222 tests 12 run range run-0000 → run-0221 window 2026-06-01 → 2026-06-04
1broken
3flaky
8healthy
0insufficient data
0test-runs passed on retry
0test-runs excluded

Test × run heatmap

Tests under tests.test_suite

test_regression_after_commit DEFECT 32%

tests.test_suite.test_regression_after_commit

Final failure rate (95% CI)32% [26%–38%] · 70 of 222 runs
Usable outcomesruns: 222; skipped: 0; excluded: 0
Passed on retry0 (explicit failed attempts before a pass)
Retry exhaustion0 (every recorded attempt failed)
Flip rate0.45% of 221 usable consecutive pairs
Same-context rerun disagreement0/32 commit/branch/runner/OS groups; 0% of same-commit run pairs
Flakiness score0.128
Failures on a commit run again0 of 20 passed in another run of the same commit; 20 failed in every run of it; 50 more had no other run
Change point0% → 100% failure rate at run run-0152 (commit 00082aaaaaaa)
Duration trend (without retries)+0.0 ms/history run
Timing observations (without retries)222
Duration × failure correlation+0.10
Failure rate by runnermacos-latest: 32% (n=47), ubuntu-latest: 31% (n=175)
Failure rate by OSmacos: 32% (n=47), linux: 31% (n=175)
Failure messages
  • Failed: off-by-one regression introduced at commit 130 ×70

Failures, newest first

RunSame commit, other runsOther tests failedNamed in output, or message
run-0221
2026-06-04 09:27
000bdaaaaaaa
no other run
noneFailed: off-by-one regression introduced at commit 130
run-0220
2026-06-04 09:04
000bcaaaaaaa
no other run
1Failed: off-by-one regression introduced at commit 130
run-0219
2026-06-04 08:41
000bbaaaaaaa
no other run
2Failed: off-by-one regression introduced at commit 130
run-0218
2026-06-04 08:22
000baaaaaaaa
failed in every run (2 of this commit)
2Failed: off-by-one regression introduced at commit 130
run-0217
2026-06-04 08:18
000baaaaaaaa
failed in every run (2 of this commit)
noneFailed: off-by-one regression introduced at commit 130
run-0216
2026-06-04 07:55
000b9aaaaaaa
no other run
noneFailed: off-by-one regression introduced at commit 130
run-0215
2026-06-04 07:32
000b8aaaaaaa
no other run
noneFailed: off-by-one regression introduced at commit 130
run-0214
2026-06-04 07:09
000b7aaaaaaa
no other run
1Failed: off-by-one regression introduced at commit 130
run-0213
2026-06-04 06:46
000b6aaaaaaa
no other run
noneFailed: off-by-one regression introduced at commit 130
run-0212
2026-06-04 06:23
000b5aaaaaaa
no other run
1Failed: off-by-one regression introduced at commit 130
run-0211
2026-06-04 06:04
000b4aaaaaaa
failed in every run (2 of this commit)
noneFailed: off-by-one regression introduced at commit 130
run-0210
2026-06-04 06:00
000b4aaaaaaa
failed in every run (2 of this commit)
noneFailed: off-by-one regression introduced at commit 130
run-0209
2026-06-04 05:37
000b3aaaaaaa
no other run
2Failed: off-by-one regression introduced at commit 130
run-0208
2026-06-04 05:14
000b2aaaaaaa
no other run
1Failed: off-by-one regression introduced at commit 130
run-0207
2026-06-04 04:51
000b1aaaaaaa
no other run
2Failed: off-by-one regression introduced at commit 130
run-0206
2026-06-04 04:28
000b0aaaaaaa
no other run
1Failed: off-by-one regression introduced at commit 130
run-0205
2026-06-04 04:05
000afaaaaaaa
no other run
1Failed: off-by-one regression introduced at commit 130
run-0204
2026-06-04 03:46
000aeaaaaaaa
failed in every run (2 of this commit)
1Failed: off-by-one regression introduced at commit 130
run-0203
2026-06-04 03:42
000aeaaaaaaa
failed in every run (2 of this commit)
noneFailed: off-by-one regression introduced at commit 130
run-0202
2026-06-04 03:19
000adaaaaaaa
no other run
noneFailed: off-by-one regression introduced at commit 130
run-0201
2026-06-04 02:56
000acaaaaaaa
no other run
1Failed: off-by-one regression introduced at commit 130
run-0200
2026-06-04 02:33
000abaaaaaaa
no other run
1Failed: off-by-one regression introduced at commit 130
run-0199
2026-06-04 02:10
000aaaaaaaaa
no other run
1Failed: off-by-one regression introduced at commit 130
run-0198
2026-06-04 01:47
000a9aaaaaaa
no other run
1Failed: off-by-one regression introduced at commit 130
run-0197
2026-06-04 01:28
000a8aaaaaaa
failed in every run (2 of this commit)
noneFailed: off-by-one regression introduced at commit 130
run-0196
2026-06-04 01:24
000a8aaaaaaa
failed in every run (2 of this commit)
1Failed: off-by-one regression introduced at commit 130
run-0195
2026-06-04 01:01
000a7aaaaaaa
no other run
2Failed: off-by-one regression introduced at commit 130
run-0194
2026-06-04 00:38
000a6aaaaaaa
no other run
1Failed: off-by-one regression introduced at commit 130
run-0193
2026-06-04 00:15
000a5aaaaaaa
no other run
1Failed: off-by-one regression introduced at commit 130
run-0192
2026-06-03 23:52
000a4aaaaaaa
no other run
1Failed: off-by-one regression introduced at commit 130
run-0191
2026-06-03 23:29
000a3aaaaaaa
no other run
1Failed: off-by-one regression introduced at commit 130
run-0190
2026-06-03 23:10
000a2aaaaaaa
failed in every run (2 of this commit)
noneFailed: off-by-one regression introduced at commit 130
run-0189
2026-06-03 23:06
000a2aaaaaaa
failed in every run (2 of this commit)
2Failed: off-by-one regression introduced at commit 130
run-0188
2026-06-03 22:43
000a1aaaaaaa
no other run
2Failed: off-by-one regression introduced at commit 130
run-0187
2026-06-03 22:20
000a0aaaaaaa
no other run
2Failed: off-by-one regression introduced at commit 130
run-0186
2026-06-03 21:57
0009faaaaaaa
no other run
1Failed: off-by-one regression introduced at commit 130
run-0185
2026-06-03 21:34
0009eaaaaaaa
no other run
1Failed: off-by-one regression introduced at commit 130
run-0184
2026-06-03 21:11
0009daaaaaaa
no other run
1Failed: off-by-one regression introduced at commit 130
run-0183
2026-06-03 20:52
0009caaaaaaa
failed in every run (2 of this commit)
noneFailed: off-by-one regression introduced at commit 130
run-0182
2026-06-03 20:48
0009caaaaaaa
failed in every run (2 of this commit)
1Failed: off-by-one regression introduced at commit 130

Showing the latest 40 of 70 failures; --json has every one.

test_reads_cache_depends_on_order INTERMITTENT 48%

tests.test_suite.test_reads_cache_depends_on_order

Final failure rate (95% CI)48% [41%–54%] · 106 of 222 runs
Usable outcomesruns: 222; skipped: 0; excluded: 0
Passed on retry0 (explicit failed attempts before a pass)
Retry exhaustion0 (every recorded attempt failed)
Flip rate48% of 221 usable consecutive pairs
Same-context rerun disagreement19/32 commit/branch/runner/OS groups; 59% of same-commit run pairs
Flakiness score0.620
Failures on a commit run again19 of 27 passed in another run of the same commit; 8 failed in every run of it; 79 more had no other run
ActivityOngoing: 106 failures in 53 separate stretches; the longest quiet spell between failures was 6 runs, and the last failure was 1 runs ago.
Duration trend (without retries)-0.0 ms/history run
Timing observations (without retries)222
Duration × failure correlation+0.12
Failure rate by runnermacos-latest: 51% (n=47), ubuntu-latest: 47% (n=175)
Failure rate by OSmacos: 51% (n=47), linux: 47% (n=175)
Failure messages
  • AssertionError: cache was not warmed before this test ran ×106

Failures, newest first

RunSame commit, other runsOther tests failedNamed in output, or message
run-0220
2026-06-04 09:04
000bcaaaaaaa
no other run
1AssertionError: cache was not warmed before this test ran
run-0219
2026-06-04 08:41
000bbaaaaaaa
no other run
2AssertionError: cache was not warmed before this test ran
run-0218
2026-06-04 08:22
000baaaaaaaa
passed in another run (2 of this commit)
2AssertionError: cache was not warmed before this test ran
run-0212
2026-06-04 06:23
000b5aaaaaaa
no other run
1AssertionError: cache was not warmed before this test ran
run-0209
2026-06-04 05:37
000b3aaaaaaa
no other run
2AssertionError: cache was not warmed before this test ran
run-0208
2026-06-04 05:14
000b2aaaaaaa
no other run
1AssertionError: cache was not warmed before this test ran
run-0207
2026-06-04 04:51
000b1aaaaaaa
no other run
2AssertionError: cache was not warmed before this test ran
run-0205
2026-06-04 04:05
000afaaaaaaa
no other run
1AssertionError: cache was not warmed before this test ran
run-0204
2026-06-04 03:46
000aeaaaaaaa
passed in another run (2 of this commit)
1AssertionError: cache was not warmed before this test ran
run-0201
2026-06-04 02:56
000acaaaaaaa
no other run
1AssertionError: cache was not warmed before this test ran
run-0198
2026-06-04 01:47
000a9aaaaaaa
no other run
1AssertionError: cache was not warmed before this test ran
run-0192
2026-06-03 23:52
000a4aaaaaaa
no other run
1AssertionError: cache was not warmed before this test ran
run-0189
2026-06-03 23:06
000a2aaaaaaa
passed in another run (2 of this commit)
2AssertionError: cache was not warmed before this test ran
run-0188
2026-06-03 22:43
000a1aaaaaaa
no other run
2AssertionError: cache was not warmed before this test ran
run-0187
2026-06-03 22:20
000a0aaaaaaa
no other run
2AssertionError: cache was not warmed before this test ran
run-0185
2026-06-03 21:34
0009eaaaaaaa
no other run
1AssertionError: cache was not warmed before this test ran
run-0184
2026-06-03 21:11
0009daaaaaaa
no other run
1AssertionError: cache was not warmed before this test ran
run-0181
2026-06-03 20:25
0009baaaaaaa
no other run
2AssertionError: cache was not warmed before this test ran
run-0178
2026-06-03 19:16
00098aaaaaaa
no other run
1AssertionError: cache was not warmed before this test ran
run-0177
2026-06-03 18:53
00097aaaaaaa
no other run
1AssertionError: cache was not warmed before this test ran
run-0176
2026-06-03 18:34
00096aaaaaaa
passed in another run (2 of this commit)
1AssertionError: cache was not warmed before this test ran
run-0173
2026-06-03 17:44
00094aaaaaaa
no other run
1AssertionError: cache was not warmed before this test ran
run-0169
2026-06-03 16:16
00090aaaaaaa
passed in another run (2 of this commit)
1AssertionError: cache was not warmed before this test ran
run-0167
2026-06-03 15:49
0008faaaaaaa
no other run
2AssertionError: cache was not warmed before this test ran
run-0165
2026-06-03 15:03
0008daaaaaaa
no other run
2AssertionError: cache was not warmed before this test ran
run-0160
2026-06-03 13:31
00089aaaaaaa
no other run
1AssertionError: cache was not warmed before this test ran
run-0156
2026-06-03 11:59
00085aaaaaaa
no other run
1AssertionError: cache was not warmed before this test ran
run-0155
2026-06-03 11:40
00084aaaaaaa
failed in every run (2 of this commit)
1AssertionError: cache was not warmed before this test ran
run-0154
2026-06-03 11:36
00084aaaaaaa
failed in every run (2 of this commit)
1AssertionError: cache was not warmed before this test ran
run-0153
2026-06-03 11:13
00083aaaaaaa
no other run
1AssertionError: cache was not warmed before this test ran
run-0152
2026-06-03 10:50
00082aaaaaaa
no other run
1AssertionError: cache was not warmed before this test ran
run-0151
2026-06-03 10:27
00081aaaaaaa
no other run
noneAssertionError: cache was not warmed before this test ran
run-0150
2026-06-03 10:04
00080aaaaaaa
no other run
1AssertionError: cache was not warmed before this test ran
run-0146
2026-06-03 08:55
0007daaaaaaa
no other run
noneAssertionError: cache was not warmed before this test ran
run-0144
2026-06-03 08:09
0007baaaaaaa
no other run
1AssertionError: cache was not warmed before this test ran
run-0143
2026-06-03 07:46
0007aaaaaaaa
no other run
noneAssertionError: cache was not warmed before this test ran
run-0142
2026-06-03 07:23
00079aaaaaaa
no other run
noneAssertionError: cache was not warmed before this test ran
run-0141
2026-06-03 07:04
00078aaaaaaa
failed in every run (2 of this commit)
1AssertionError: cache was not warmed before this test ran
run-0140
2026-06-03 07:00
00078aaaaaaa
failed in every run (2 of this commit)
noneAssertionError: cache was not warmed before this test ran
run-0139
2026-06-03 06:37
00077aaaaaaa
no other run
noneAssertionError: cache was not warmed before this test ran

Showing the latest 40 of 106 failures; --json has every one.

test_tight_timeout_race INTERMITTENT 29%

tests.test_suite.test_tight_timeout_race

Final failure rate (95% CI)29% [24%–36%] · 65 of 222 runs
Usable outcomesruns: 222; skipped: 0; excluded: 0
Passed on retry0 (explicit failed attempts before a pass)
Retry exhaustion0 (every recorded attempt failed)
Flip rate44% of 221 usable consecutive pairs
Same-context rerun disagreement10/32 commit/branch/runner/OS groups; 31% of same-commit run pairs
Flakiness score0.419
Failures on a commit run again10 of 14 passed in another run of the same commit; 4 failed in every run of it; 51 more had no other run
ActivityOngoing: 65 failures in 49 separate stretches; the longest quiet spell between failures was 13 runs, and the last failure was 2 runs ago.
Duration trend (without retries)+0.0 ms/history run
Timing observations (without retries)222
Duration × failure correlation+0.79
Failure rate by runnermacos-latest: 51% (n=47), ubuntu-latest: 23% (n=175)
Failure rate by OSmacos: 51% (n=47), linux: 23% (n=175)
Failure messages
  • AssertionError: took 0.0135s, budget 0.0125s ×65

Failures, newest first

RunSame commit, other runsOther tests failedNamed in output, or message
run-0219
2026-06-04 08:41
000bbaaaaaaa
no other run
2AssertionError: took 0.0172s, budget 0.0125s
run-0218
2026-06-04 08:22
000baaaaaaaa
passed in another run (2 of this commit)
2AssertionError: took 0.0135s, budget 0.0125s
run-0214
2026-06-04 07:09
000b7aaaaaaa
no other run
1AssertionError: took 0.0136s, budget 0.0125s
run-0200
2026-06-04 02:33
000abaaaaaaa
no other run
1AssertionError: took 0.0173s, budget 0.0125s
run-0196
2026-06-04 01:24
000a8aaaaaaa
passed in another run (2 of this commit)
1AssertionError: took 0.0137s, budget 0.0125s
run-0195
2026-06-04 01:01
000a7aaaaaaa
no other run
2AssertionError: took 0.0134s, budget 0.0125s
run-0194
2026-06-04 00:38
000a6aaaaaaa
no other run
1AssertionError: took 0.0143s, budget 0.0125s
run-0193
2026-06-04 00:15
000a5aaaaaaa
no other run
1AssertionError: took 0.0126s, budget 0.0125s
run-0191
2026-06-03 23:29
000a3aaaaaaa
no other run
1AssertionError: took 0.0145s, budget 0.0125s
run-0188
2026-06-03 22:43
000a1aaaaaaa
no other run
2AssertionError: took 0.0139s, budget 0.0125s
run-0187
2026-06-03 22:20
000a0aaaaaaa
no other run
2AssertionError: took 0.0136s, budget 0.0125s
run-0186
2026-06-03 21:57
0009faaaaaaa
no other run
1AssertionError: took 0.0151s, budget 0.0125s
run-0181
2026-06-03 20:25
0009baaaaaaa
no other run
2AssertionError: took 0.0130s, budget 0.0125s
run-0179
2026-06-03 19:39
00099aaaaaaa
no other run
1AssertionError: took 0.0127s, budget 0.0125s
run-0167
2026-06-03 15:49
0008faaaaaaa
no other run
2AssertionError: took 0.0164s, budget 0.0125s
run-0166
2026-06-03 15:26
0008eaaaaaaa
no other run
1AssertionError: took 0.0149s, budget 0.0125s
run-0165
2026-06-03 15:03
0008daaaaaaa
no other run
2AssertionError: took 0.0135s, budget 0.0125s
run-0164
2026-06-03 14:40
0008caaaaaaa
no other run
1AssertionError: took 0.0143s, budget 0.0125s
run-0163
2026-06-03 14:17
0008baaaaaaa
no other run
1AssertionError: took 0.0165s, budget 0.0125s
run-0161
2026-06-03 13:54
0008aaaaaaaa
passed in another run (2 of this commit)
2AssertionError: took 0.0135s, budget 0.0125s
run-0158
2026-06-03 12:45
00087aaaaaaa
no other run
1AssertionError: took 0.0169s, budget 0.0125s
run-0149
2026-06-03 09:41
0007faaaaaaa
no other run
noneAssertionError: took 0.0138s, budget 0.0125s
run-0144
2026-06-03 08:09
0007baaaaaaa
no other run
1AssertionError: took 0.0171s, budget 0.0125s
run-0141
2026-06-03 07:04
00078aaaaaaa
passed in another run (2 of this commit)
1AssertionError: took 0.0138s, budget 0.0125s
run-0137
2026-06-03 05:51
00075aaaaaaa
no other run
noneAssertionError: took 0.0141s, budget 0.0125s
run-0135
2026-06-03 05:05
00073aaaaaaa
no other run
noneAssertionError: took 0.0151s, budget 0.0125s
run-0131
2026-06-03 03:56
00070aaaaaaa
no other run
1AssertionError: took 0.0129s, budget 0.0125s
run-0129
2026-06-03 03:10
0006eaaaaaaa
no other run
1AssertionError: took 0.0139s, budget 0.0125s
run-0125
2026-06-03 02:01
0006baaaaaaa
no other run
2AssertionError: took 0.0163s, budget 0.0125s
run-0123
2026-06-03 01:15
00069aaaaaaa
no other run
1AssertionError: took 0.0147s, budget 0.0125s
run-0116
2026-06-02 22:57
00063aaaaaaa
no other run
noneAssertionError: took 0.0164s, budget 0.0125s
run-0115
2026-06-02 22:34
00062aaaaaaa
no other run
noneAssertionError: took 0.0128s, budget 0.0125s
run-0112
2026-06-02 21:48
00060aaaaaaa
passed in another run (2 of this commit)
noneAssertionError: took 0.0143s, budget 0.0125s
run-0110
2026-06-02 21:02
0005eaaaaaaa
no other run
1AssertionError: took 0.0134s, budget 0.0125s
run-0104
2026-06-02 19:07
00059aaaaaaa
no other run
noneAssertionError: took 0.0146s, budget 0.0125s
run-0103
2026-06-02 18:44
00058aaaaaaa
no other run
2AssertionError: took 0.0146s, budget 0.0125s
run-0101
2026-06-02 17:58
00056aaaaaaa
no other run
noneAssertionError: took 0.0145s, budget 0.0125s
run-0099
2026-06-02 17:16
00054aaaaaaa
failed in every run (2 of this commit)
noneAssertionError: took 0.0142s, budget 0.0125s
run-0098
2026-06-02 17:12
00054aaaaaaa
failed in every run (2 of this commit)
1AssertionError: took 0.0127s, budget 0.0125s
run-0097
2026-06-02 16:49
00053aaaaaaa
no other run
1AssertionError: took 0.0171s, budget 0.0125s

Showing the latest 40 of 65 failures; --json has every one.

test_probabilistic_threshold INTERMITTENT 12%

tests.test_suite.test_probabilistic_threshold

Final failure rate (95% CI)12% [8.1%–17%] · 26 of 222 runs
Usable outcomesruns: 222; skipped: 0; excluded: 0
Passed on retry0 (explicit failed attempts before a pass)
Retry exhaustion0 (every recorded attempt failed)
Flip rate20% of 221 usable consecutive pairs
Same-context rerun disagreement8/32 commit/branch/runner/OS groups; 25% of same-commit run pairs
Flakiness score0.226
Failures on a commit run again8 of 8 passed in another run of the same commit; 0 failed in every run of it; 18 more had no other run
ActivityOngoing: 26 failures in 22 separate stretches; the longest quiet spell between failures was 26 runs, and the last failure was 12 runs ago.
Duration trend (without retries)-0.0 ms/history run
Timing observations (without retries)222
Duration × failure correlation+0.18
Failure rate by runnerubuntu-latest: 13% (n=175), macos-latest: 9% (n=47)
Failure rate by OSlinux: 13% (n=175), macos: 9% (n=47)
Failure messages
  • assert 0.10490622573466313 >= 0.12 ×26

Failures, newest first

RunSame commit, other runsOther tests failedNamed in output, or message
run-0209
2026-06-04 05:37
000b3aaaaaaa
no other run
2assert 0.09628953034368859 >= 0.12
run-0207
2026-06-04 04:51
000b1aaaaaaa
no other run
2assert 0.08941430936329631 >= 0.12
run-0206
2026-06-04 04:28
000b0aaaaaaa
no other run
1assert 0.08081693476273633 >= 0.12
run-0199
2026-06-04 02:10
000aaaaaaaaa
no other run
1assert 0.059334657339586094 >= 0.12
run-0195
2026-06-04 01:01
000a7aaaaaaa
no other run
2assert 0.04030508274093669 >= 0.12
run-0189
2026-06-03 23:06
000a2aaaaaaa
passed in another run (2 of this commit)
2assert 0.004820276563887282 >= 0.12
run-0182
2026-06-03 20:48
0009caaaaaaa
passed in another run (2 of this commit)
1assert 0.0218900605841974 >= 0.12
run-0161
2026-06-03 13:54
0008aaaaaaaa
passed in another run (2 of this commit)
2assert 0.0032748591168019203 >= 0.12
run-0150
2026-06-03 10:04
00080aaaaaaa
no other run
1assert 0.07920716825148089 >= 0.12
run-0136
2026-06-03 05:28
00074aaaaaaa
no other run
1assert 0.06018069615248589 >= 0.12
run-0128
2026-06-03 02:47
0006daaaaaaa
no other run
noneassert 0.05721115103909846 >= 0.12
run-0127
2026-06-03 02:28
0006caaaaaaa
passed in another run (2 of this commit)
1assert 0.017483327202417298 >= 0.12
run-0125
2026-06-03 02:01
0006baaaaaaa
no other run
2assert 0.1168758847939757 >= 0.12
run-0122
2026-06-03 00:52
00068aaaaaaa
no other run
1assert 0.03458134024717596 >= 0.12
run-0108
2026-06-02 20:16
0005caaaaaaa
no other run
1assert 0.11079116543174072 >= 0.12
run-0103
2026-06-02 18:44
00058aaaaaaa
no other run
2assert 0.037473673152819575 >= 0.12
run-0094
2026-06-02 15:40
00050aaaaaaa
no other run
1assert 0.00829278517704446 >= 0.12
run-0093
2026-06-02 15:17
0004faaaaaaa
no other run
1assert 0.046548433760871144 >= 0.12
run-0082
2026-06-02 11:50
00046aaaaaaa
no other run
2assert 0.092278873783887 >= 0.12
run-0081
2026-06-02 11:27
00045aaaaaaa
no other run
noneassert 0.020546099121637074 >= 0.12
run-0076
2026-06-02 09:55
00041aaaaaaa
no other run
noneassert 0.026162612990571654 >= 0.12
run-0049
2026-06-02 01:06
0002aaaaaaaa
passed in another run (2 of this commit)
1assert 0.08687220296726883 >= 0.12
run-0042
2026-06-01 22:48
00024aaaaaaa
passed in another run (2 of this commit)
noneassert 0.004752672418996462 >= 0.12
run-0036
2026-06-01 20:34
0001eaaaaaaa
passed in another run (2 of this commit)
1assert 0.051352199550979916 >= 0.12
run-0011
2026-06-01 12:27
00009aaaaaaa
no other run
noneassert 0.04874040894208831 >= 0.12
run-0008
2026-06-01 11:22
00006aaaaaaa
passed in another run (2 of this commit)
noneassert 0.10490622573466313 >= 0.12
test_sleep_a_bit 0%

tests.test_suite.test_sleep_a_bit

Final failure rate (95% CI)0% [0%–1.7%] · 0 of 222 runs
Usable outcomesruns: 222; skipped: 0; excluded: 0
Passed on retry0 (explicit failed attempts before a pass)
Retry exhaustion0 (every recorded attempt failed)
Flip rate0% of 221 usable consecutive pairs
Same-context rerun disagreement0/32 commit/branch/runner/OS groups; 0% of same-commit run pairs
Flakiness score0.000
Duration trend (without retries)+0.0 ms/history run
Timing observations (without retries)222
Failure rate by runnermacos-latest: 0% (n=47), ubuntu-latest: 0% (n=175)
Failure rate by OSlinux: 0% (n=175), macos: 0% (n=47)
test_string_formatting 0%

tests.test_suite.test_string_formatting

Final failure rate (95% CI)0% [0%–1.7%] · 0 of 222 runs
Usable outcomesruns: 222; skipped: 0; excluded: 0
Passed on retry0 (explicit failed attempts before a pass)
Retry exhaustion0 (every recorded attempt failed)
Flip rate0% of 221 usable consecutive pairs
Same-context rerun disagreement0/32 commit/branch/runner/OS groups; 0% of same-commit run pairs
Flakiness score0.000
Duration trend (without retries)+0.0 ms/history run
Timing observations (without retries)222
Failure rate by runnermacos-latest: 0% (n=47), ubuntu-latest: 0% (n=175)
Failure rate by OSlinux: 0% (n=175), macos: 0% (n=47)
test_list_comprehension 0%

tests.test_suite.test_list_comprehension

Final failure rate (95% CI)0% [0%–1.7%] · 0 of 222 runs
Usable outcomesruns: 222; skipped: 0; excluded: 0
Passed on retry0 (explicit failed attempts before a pass)
Retry exhaustion0 (every recorded attempt failed)
Flip rate0% of 221 usable consecutive pairs
Same-context rerun disagreement0/32 commit/branch/runner/OS groups; 0% of same-commit run pairs
Flakiness score0.000
Duration trend (without retries)+0.0 ms/history run
Timing observations (without retries)222
Failure rate by runnermacos-latest: 0% (n=47), ubuntu-latest: 0% (n=175)
Failure rate by OSlinux: 0% (n=175), macos: 0% (n=47)
test_string_split 0%

tests.test_suite.test_string_split

Final failure rate (95% CI)0% [0%–1.7%] · 0 of 222 runs
Usable outcomesruns: 222; skipped: 0; excluded: 0
Passed on retry0 (explicit failed attempts before a pass)
Retry exhaustion0 (every recorded attempt failed)
Flip rate0% of 221 usable consecutive pairs
Same-context rerun disagreement0/32 commit/branch/runner/OS groups; 0% of same-commit run pairs
Flakiness score0.000
Duration trend (without retries)-0.0 ms/history run
Timing observations (without retries)222
Failure rate by runnermacos-latest: 0% (n=47), ubuntu-latest: 0% (n=175)
Failure rate by OSlinux: 0% (n=175), macos: 0% (n=47)
test_populate_cache_first 0%

tests.test_suite.test_populate_cache_first

Final failure rate (95% CI)0% [0%–1.7%] · 0 of 222 runs
Usable outcomesruns: 222; skipped: 0; excluded: 0
Passed on retry0 (explicit failed attempts before a pass)
Retry exhaustion0 (every recorded attempt failed)
Flip rate0% of 221 usable consecutive pairs
Same-context rerun disagreement0/32 commit/branch/runner/OS groups; 0% of same-commit run pairs
Flakiness score0.000
Duration trend (without retries)+0.0 ms/history run
Timing observations (without retries)222
Failure rate by runnermacos-latest: 0% (n=47), ubuntu-latest: 0% (n=175)
Failure rate by OSlinux: 0% (n=175), macos: 0% (n=47)
test_dict_merge 0%

tests.test_suite.test_dict_merge

Final failure rate (95% CI)0% [0%–1.7%] · 0 of 222 runs
Usable outcomesruns: 222; skipped: 0; excluded: 0
Passed on retry0 (explicit failed attempts before a pass)
Retry exhaustion0 (every recorded attempt failed)
Flip rate0% of 221 usable consecutive pairs
Same-context rerun disagreement0/32 commit/branch/runner/OS groups; 0% of same-commit run pairs
Flakiness score0.000
Duration trend (without retries)+0.0 ms/history run
Timing observations (without retries)222
Failure rate by runnermacos-latest: 0% (n=47), ubuntu-latest: 0% (n=175)
Failure rate by OSlinux: 0% (n=175), macos: 0% (n=47)
test_sorted_is_stable 0%

tests.test_suite.test_sorted_is_stable

Final failure rate (95% CI)0% [0%–1.7%] · 0 of 222 runs
Usable outcomesruns: 222; skipped: 0; excluded: 0
Passed on retry0 (explicit failed attempts before a pass)
Retry exhaustion0 (every recorded attempt failed)
Flip rate0% of 221 usable consecutive pairs
Same-context rerun disagreement0/32 commit/branch/runner/OS groups; 0% of same-commit run pairs
Flakiness score0.000
Duration trend (without retries)+0.0 ms/history run
Timing observations (without retries)222
Failure rate by runnermacos-latest: 0% (n=47), ubuntu-latest: 0% (n=175)
Failure rate by OSlinux: 0% (n=175), macos: 0% (n=47)
test_addition 0%

tests.test_suite.test_addition

Final failure rate (95% CI)0% [0%–1.7%] · 0 of 222 runs
Usable outcomesruns: 222; skipped: 0; excluded: 0
Passed on retry0 (explicit failed attempts before a pass)
Retry exhaustion0 (every recorded attempt failed)
Flip rate0% of 221 usable consecutive pairs
Same-context rerun disagreement0/32 commit/branch/runner/OS groups; 0% of same-commit run pairs
Flakiness score0.000
Duration trend (without retries)+0.0 ms/history run
Timing observations (without retries)222
Failure rate by runnermacos-latest: 0% (n=47), ubuntu-latest: 0% (n=175)
Failure rate by OSlinux: 0% (n=175), macos: 0% (n=47)
pass passed on retry fail error skip not run unknown / excluded Rates use the final outcome of each run; retry attempts do not increase the sample size. Rows sorted broken → new → flaky → quiet → insufficient data → healthy, then by score. Columns are runs in chronological order. Click a row for detail. Hover a cell for the run.